{8} Active Tickets, Mine first (1306 matches)

  • List all active tickets by priority.
  • Show all tickets owned by the logged in user in a group first.

Results (1 - 100 of 1306)

1 2 3 4 5 6 7 8 9 10 11

Active Tickets (100 matches)

Ticket Summary Component Version Milestone Type Owner Status Created
#8131 T7571 with WAY=llvm fails, but not WAY=optllvm Compiler 7.7 bug rwbarton infoneeded Aug 14, 2013
#8102 Parallel build of HEAD consistently fails Build System 7.7 7.10.1 bug infoneeded Jul 29, 2013
#5019 OS X: ld: warning: could not create compact unwind for _ffi_call_unix64 Compiler 7.1 7.8.3 bug infoneeded Mar 13, 2011
#7011 32bit GHC 7.4.2 cannot compile integer-gmp on OS X 10.8 libraries (other) 7.5 7.8.3 bug infoneeded Jun 19, 2012
#7028 incorrect link paths for in mac os x after install Build System 7.4.2 7.8.3 bug leroux infoneeded Jun 24, 2012
#7919 Heap corruption (segfault) from large 'let' expression Runtime System 7.6.3 7.8.3 bug infoneeded May 17, 2013
#8366 haskeline Posix backend needs #include <sys/termios.h> on Solaris libraries (other) 7.7 7.8.3 bug thoughtpolice infoneeded Sep 26, 2013
#8475 Library docs: broken links to Foreign.ForeignPtr Documentation 7.6.3 7.8.3 bug hellertime infoneeded Oct 24, 2013
#7987 GHC Build Error Compiler 7.7 bug infoneeded Jun 16, 2013
#7836 Runtime failure profiling with +RTS -hc -hbdrag,void Profiling 7.4.2 bug infoneeded Apr 14, 2013
#8013 Strange closure type error building hs-kqueue on FreeBSD Compiler (LLVM) 7.6.3 bug infoneeded Jun 26, 2013
#8093 Runtime Internal Error with setNumCapabilities 1 Runtime System 7.6.3 bug infoneeded Jul 25, 2013
#8097 internal error: getMBlock: mmap: Operation not permitted Compiler 7.4.2 bug infoneeded Jul 27, 2013
#8406 Invalid object in isRetainer() or Segfault Compiler 7.6.3 bug infoneeded Oct 4, 2013
#8938 Should fallback instead of EXIT_FAILURE on clock_gettime failure Runtime System 7.6.3 bug simonmar infoneeded Mar 28, 2014
#7189 RTS Assertion Crash Runtime System 7.4.2 7.8.3 bug simonmar infoneeded Aug 26, 2012
#7763 Resource limits for Haskell Profiling 7.7 7.8.3 feature request simonmar infoneeded Mar 12, 2013
#5188 Runtime error when allocating lots of memory GHCi 6.12.1 7.6.2 bug infoneeded May 10, 2011
#8458 T5435_dyn_asm fails on x86_64 Linux Runtime System 7.7 bug ezyang merge Oct 18, 2013
#8641 ghc with -odir and -prof (or any stub file) does not create the specified output directory Compiler 7.9 bug ezyang merge Dec 30, 2013
#8966 Pattern synonyms and kind-polymorphism Compiler (Type checker) 7.8.1-rc2 bug simonpj merge Apr 7, 2014
#8498 gcc hardcoded in build scripts! (ignores the --with-gcc= flag in configure) Compiler 7.7 7.8.3 bug merge Nov 2, 2013
#8932 Panic with TemplateHaskell and duplicate indentifiers Template Haskell 7.8.1-rc2 bug merge Mar 27, 2014
#8985 Strange kind error with type family, GADTs, data kinds, and kind polymorphism Compiler (Type checker) 7.8.1 bug merge Apr 11, 2014
#8848 Warning: Rule too complicated to desugar Compiler 7.8.1-rc2 7.8.3 bug merge Mar 4, 2014
#8954 Reifying the nullary unboxed tuple is broken Template Haskell 7.8.1-rc2 7.8.3 bug merge Apr 3, 2014
#8115 GHC 64-bit Windows build failures with LLVM Compiler 7.6.3 bug new Aug 5, 2013
#8330 Remove ExtsCompat46 module once we bootstrap with GHC 7.8 Compiler 7.7 7.10.1 task new Sep 19, 2013
#5987 Too many symbols in ghc package DLL Compiler 7.5 7.8.3 bug thoughtpolice new Apr 3, 2012
#7478 setSessionDynFlags does not always work Compiler 7.7 7.8.3 bug new Dec 4, 2012
#7602 Threaded RTS performing badly on recent OS X (10.8?) Runtime System 7.8.3 bug thoughtpolice new Jan 17, 2013
#8228 GHC built under Windows does not generate dyn_hi files Compiler 7.7 7.8.3 bug thoughtpolice new Sep 5, 2013
#8376 Static Executable + GHC API (+ Dynamic Linking?) gives Segfault Compiler 7.7 7.8.3 bug thoughtpolice new Sep 28, 2013
#9001 unexpected runtime crash Runtime System 7.8.2 7.8.3 bug simonmar new Apr 16, 2014
#5757 zero unexpected failures on all tier 1 platforms Test Suite 7.2.1 7.8.3 task new Jan 9, 2012
#8168 ghc "Simplifier ticks exhausted" "When trying UnfoldingDone" Compiler 7.6.3 bug new Aug 24, 2013
#8374 `tcIfaceGlobal (local): not found` while compiling Build System 7.7 bug thoughtpolice new Sep 28, 2013
#4144 Exception: ToDo: hGetBuf - when using custom handle infrastructure libraries/base 7.6.1 7.10.1 bug new Jun 21, 2010
#8279 bad alignment in code gen yields substantial perf issue Compiler 7.7 7.10.1 bug new Sep 12, 2013
#8787 compiler/ghc.mk: restore GhcHcOpts variable handling Compiler 7.6.3 7.10.1 bug thoughtpolice new Feb 15, 2014
#8789 includes/stg/SMP.h: use 'NOSMP' instead of never defined 'WITHSMP' Compiler 7.6.3 7.10.1 bug thoughtpolice new Feb 15, 2014
#8299 Add richer data model address arithmetic: AddrDiff and AddrInt (ie d Int_ptr_diff and Int_ptr_size) Compiler 7.6.3 7.10.1 feature request new Sep 14, 2013
#8364 equip GHC with an accurate internal model of floating point Compiler 7.6.3 7.10.1 feature request new Sep 26, 2013
#8396 cleanup / refactor native code gens Compiler 7.10.1 feature request new Oct 2, 2013
#8287 exploring calling convention changes and related engineering for 7.10 Compiler 7.6.3 7.10.1 task new Sep 13, 2013
#8785 Replace hooks API in the RTS with something better Runtime System 7.6.3 7.10.1 task simonmar new Feb 14, 2014
#5051 Typechecker behaviour change Compiler 7.0.2 7.2.1 bug new Mar 26, 2011
#5610 Improve "Unacceptable argument type in foreign declaration" error message Compiler (Type checker) 7.6.1-rc1 7.4.1 feature request new Nov 7, 2011
#4012 Compilation results are not deterministic Compiler 6.12.2 7.6.2 bug new Apr 24, 2010
#4245 ghci panic: thread blocked indefinitely in an MVar operation GHCi 6.12.3 7.6.2 bug tibbe new Aug 7, 2010
#5539 GHC panic - Simplifier ticks exhausted Compiler 7.3 7.6.2 bug simonpj new Oct 8, 2011
#5620 Dynamic linking and threading does not work on Windows Runtime System 7.2.1 7.6.2 bug new Nov 10, 2011
#5642 Deriving Generic of a big type takes a long time and lots of space Compiler 7.3 7.6.2 bug dimitris new Nov 17, 2011
#5763 Confusing error message Compiler 7.2.2 7.6.2 bug simonpj new Jan 11, 2012
#5859 unsafeInterleaveIO duplicates computation when evaluated by multiple threads libraries/base 7.2.2 7.6.2 bug simonpj new Feb 8, 2012
#5954 Performance regression 7.0 -> 7.2 (still in 7.4) Compiler 7.4.1 7.6.2 bug simonpj new Mar 20, 2012
#6166 Performance regression in mwc-random since 7.0.x Compiler 7.4.2 7.6.2 bug new Jun 15, 2012
#7103 Compiler panic, when loading wxc in GHCi GHCi 7.4.2 7.6.2 bug new Jul 28, 2012
#7277 Recompilation check fails for TH unless functions are inlined Template Haskell 7.4.2 7.6.2 bug new Sep 28, 2012
#7320 GHC crashes when building on 32-bit Linux in a Linode Runtime System 7.6.1 7.6.2 bug simonmar new Oct 12, 2012
#7325 threadDelay mistreats minBound and maxBound in some configurations Runtime System 7.6.1 7.6.2 bug new Oct 13, 2012
#314 #line pragmas not respected inside nested comments Compiler (Parser) 6.4 7.8.3 bug new Feb 28, 2005
#781 GHCi on x86_64, cannot link to static data in shared libs Compiler 6.5 7.8.3 bug new May 31, 2006
#2725 Remove Hack in compiler/nativeGen/MachCodeGen.hs Compiler (NCG) 6.11 7.8.3 bug thoughtpolice new Oct 26, 2008
#3831 SpecConstr should exploit cases where there is exactly one call pattern Compiler 6.13 7.8.3 bug simonpj new Jan 20, 2010
#3927 Incomplete/overlapped pattern warnings + GADTs = inadequate Compiler 6.12.1 7.8.3 bug simonpj new Mar 18, 2010
#5442 ghc-pkg unregister --user/--global/--package-conf not normative ghc-pkg 7.2.1 7.8.3 bug bgamari new Aug 30, 2011
#5780 -faggressive-primops change caused a failure in perf/compiler/parsing001 Compiler 7.2.2 7.8.3 bug new Jan 16, 2012
#5902 Cannot tell from an exception handler whether the exception was asynchronous Compiler 7.4.1 7.8.3 bug simonmar new Feb 27, 2012
#6022 GHC infers over-general types Compiler 7.4.1 7.8.3 bug simonpj new Apr 19, 2012
#6098 debugger does not know the correct type for a newtype field GHCi 7.5 7.8.3 bug ptc new May 15, 2012
#7056 GHCi loadArchive "libiconv.a":failed Unknown PEi386 section name `.drectve' GHCi 7.4.1 7.8.3 bug thoughtpolice new Jul 7, 2012
#7068 Extensive Memory usage (regression) Compiler 7.4.1 7.8.3 bug simonpj new Jul 11, 2012
#7097 linker fails to load package with binding to foreign library Runtime System 7.4.2 7.8.3 bug new Jul 25, 2012
#7143 ghc-7.6.0.20120810-x86_64-windows.exe -> ghc can't figure out LLVM version Compiler (LLVM) 7.6.1-rc1 7.8.3 bug dterei new Aug 14, 2012
#7152 Add flag to configure that skips overwriting of symlinks on install Build System 7.4.2 7.8.3 bug thoughtpolice new Aug 15, 2012
#7198 New codegen more than doubles compile time of T3294 Compiler 7.4.2 7.8.3 bug simonmar new Aug 29, 2012
#7200 template-haskell-2.7.0.0 fails to build with GHC 7.0.4 due to missing pragma Template Haskell 7.0.4 7.8.3 bug duncan new Aug 29, 2012
#7273 Binary size increase in nofib/grep between 7.6.1 and HEAD Compiler 7.6.1 7.8.3 bug new Sep 28, 2012
#7289 Mingw FPU init not Windows compatible. Runtime System 7.2.2 7.8.3 bug new Oct 2, 2012
#7298 Test 2228 fails with dynamic-by-default GHCi 7.6.1 7.8.3 bug new Oct 5, 2012
#7411 Exceptions are optimized away in certain situations Compiler 7.6.1 7.8.3 bug new Nov 13, 2012
#7428 GHC compile times are seriously non-linear in program size Compiler 7.4.2 7.8.3 bug new Nov 19, 2012
#7452 [GNU gold] ld: error: cannot find [...]/Types__1.o Build System 7.6.1 7.8.3 bug new Nov 26, 2012
#7490 ghc-stage1 panic when building a cross-compiler or cross-building a compiler Compiler 7.7 7.8.3 bug new Dec 8, 2012
#7521 Simplifier ticks exhausted when compiling Accelerate example. Compiler 7.6.1 7.8.3 bug new Dec 21, 2012
#7567 invalidateModSummaryCache throws exception if ms_hs_date is 0 Compiler 7.6.1 7.8.3 bug new Jan 10, 2013
#7598 ghc-stage1 generates wrong assembler on StgCmmPrim (operand out of range) Compiler 7.7 7.8.3 bug new Jan 16, 2013
#7651 Buiding GHC with parallel IO manager freezes on Mac (not on FreeBSD) Build System 7.7 7.8.3 bug new Feb 2, 2013
#7679 Regression in -fregs-graph performance Compiler (NCG) 7.6.2 7.8.3 bug new Feb 11, 2013
#8224 Excessive system time -- new IO manager problem? Runtime System 7.7 7.8.3 bug new Sep 4, 2013
#8303 defer StackOverflow exceptions (rather than dropping them) when exceptions are masked Runtime System 7.7 7.8.3 bug thoughtpolice new Sep 15, 2013
#8362 Filesystem related tests failed on solaris (SmartOS) libraries (other) 7.6.3 7.8.3 bug new Sep 26, 2013
#8736 GHCi doesn't load .dyn_o files appropriately Compiler 7.8.1-rc2 7.8.3 bug thoughtpolice new Feb 4, 2014
#8935 Obscure linker bug leads to crash in GHCi Runtime System 7.8.1-rc2 7.8.3 bug simonmar new Mar 28, 2014
#9007 fails to build with hardening flags enabled (relocation R_X86_64_32 against `stg_CHARLIKE_closure'...) Compiler 7.9 7.8.3 bug simonmar new Apr 17, 2014
#4879 Deprecate exports Compiler 7.0.1 7.8.3 feature request new Jan 5, 2011
#5218 Add unpackCStringLen# to create Strings from string literals Compiler 7.0.3 7.8.3 feature request thoughtpolice new May 25, 2011
#5910 Holes with other constraints Compiler (Type checker) 7.5 7.8.3 feature request new Mar 2, 2012
#7300 Allow CAFs kept reachable by FFI to be forcibly made unreachable for GC Compiler (FFI) 7.4.1 7.8.3 feature request new Oct 5, 2012
1 2 3 4 5 6 7 8 9 10 11
Note: See TracReports for help on using and creating reports.