{1} Bugs by priority (812 matches)

Lists all open bugs in order of priority.

Results (1 - 100 of 812)

1 2 3 4 5 6 7 8 9
Ticket Summary Component Version Priority Severity Milestone Owner Status Created
#8131 T7571 with WAY=llvm fails, but not WAY=optllvm Compiler 7.7 high rwbarton infoneeded Aug 14, 2013
#8168 ghc "Simplifier ticks exhausted" "When trying UnfoldingDone" Compiler 7.6.3 high new Aug 24, 2013
#8374 `tcIfaceGlobal (local): not found` while compiling Build System 7.7 high thoughtpolice new Sep 28, 2013
#8528 Preprocessor issues building GHC HEAD on Mavericks Compiler 7.7 high new Nov 13, 2013
#8626 Bad magic. Expected: feedfacf, got: feedface GHCi 7.6.3 high new Dec 23, 2013
#8819 64bit Testsuite failures in unregisterised 7.8 RCs Compiler 7.8.1-rc2 high new Feb 24, 2014
#4144 Exception: ToDo: hGetBuf - when using custom handle infrastructure libraries/base 7.6.1 high 7.10.1 new Jun 21, 2010
#8102 Parallel build of HEAD consistently fails Build System 7.7 high 7.10.1 infoneeded Jul 29, 2013
#8279 bad alignment in code gen yields substantial perf issue Compiler 7.7 high 7.10.1 new Sep 12, 2013
#8787 compiler/ghc.mk: restore GhcHcOpts variable handling Compiler 7.6.3 high 7.10.1 thoughtpolice new Feb 15, 2014
#8789 includes/stg/SMP.h: use 'NOSMP' instead of never defined 'WITHSMP' Compiler 7.6.3 high 7.10.1 thoughtpolice new Feb 15, 2014
#5051 Typechecker behaviour change Compiler 7.0.2 high 7.2.1 new Mar 26, 2011
#4012 Compilation results are not deterministic Compiler 6.12.2 high 7.6.2 new Apr 24, 2010
#4245 ghci panic: thread blocked indefinitely in an MVar operation GHCi 6.12.3 high 7.6.2 tibbe new Aug 7, 2010
#5539 GHC panic - Simplifier ticks exhausted Compiler 7.3 high 7.6.2 simonpj new Oct 8, 2011
#5620 Dynamic linking and threading does not work on Windows Runtime System 7.2.1 high 7.6.2 new Nov 10, 2011
#5642 Deriving Generic of a big type takes a long time and lots of space Compiler 7.3 high 7.6.2 dimitris new Nov 17, 2011
#5763 Confusing error message Compiler 7.2.2 high 7.6.2 simonpj new Jan 11, 2012
#5859 unsafeInterleaveIO duplicates computation when evaluated by multiple threads libraries/base 7.2.2 high 7.6.2 simonpj new Feb 8, 2012
#5954 Performance regression 7.0 -> 7.2 (still in 7.4) Compiler 7.4.1 high 7.6.2 simonpj new Mar 20, 2012
#6166 Performance regression in mwc-random since 7.0.x Compiler 7.4.2 high 7.6.2 new Jun 15, 2012
#7103 Compiler panic, when loading wxc in GHCi GHCi 7.4.2 high 7.6.2 new Jul 28, 2012
#7277 Recompilation check fails for TH unless functions are inlined Template Haskell 7.4.2 high 7.6.2 new Sep 28, 2012
#7320 GHC crashes when building on 32-bit Linux in a Linode Runtime System 7.6.1 high 7.6.2 simonmar new Oct 12, 2012
#7325 threadDelay mistreats minBound and maxBound in some configurations Runtime System 7.6.1 high 7.6.2 new Oct 13, 2012
#314 #line pragmas not respected inside nested comments Compiler (Parser) 6.4 high normal 7.8.3 new Feb 28, 2005
#781 GHCi on x86_64, cannot link to static data in shared libs Compiler 6.5 high normal 7.8.3 new May 31, 2006
#2725 Remove Hack in compiler/nativeGen/MachCodeGen.hs Compiler (NCG) 6.11 high minor 7.8.3 thoughtpolice new Oct 26, 2008
#3472 Porting through .hc files broken Build System 6.12.1 RC1 high normal 7.8.3 new Aug 29, 2009
#3831 SpecConstr should exploit cases where there is exactly one call pattern Compiler 6.13 high 7.8.3 simonpj new Jan 20, 2010
#3927 Incomplete/overlapped pattern warnings + GADTs = inadequate Compiler 6.12.1 high 7.8.3 simonpj new Mar 18, 2010
#5019 OS X: ld: warning: could not create compact unwind for _ffi_call_unix64 Compiler 7.1 high 7.8.3 infoneeded Mar 13, 2011
#5442 ghc-pkg unregister --user/--global/--package-conf not normative ghc-pkg 7.2.1 high 7.8.3 bgamari new Aug 30, 2011
#5780 -faggressive-primops change caused a failure in perf/compiler/parsing001 Compiler 7.2.2 high 7.8.3 new Jan 16, 2012
#5902 Cannot tell from an exception handler whether the exception was asynchronous Compiler 7.4.1 high 7.8.3 simonmar new Feb 27, 2012
#6022 GHC infers over-general types Compiler 7.4.1 high 7.8.3 simonpj new Apr 19, 2012
#6098 debugger does not know the correct type for a newtype field GHCi 7.5 high 7.8.3 ptc new May 15, 2012
#7011 32bit GHC 7.4.2 cannot compile integer-gmp on OS X 10.8 libraries (other) 7.5 high 7.8.3 infoneeded Jun 19, 2012
#7028 incorrect link paths for in mac os x after install Build System 7.4.2 high 7.8.3 leroux infoneeded Jun 24, 2012
#7056 GHCi loadArchive "libiconv.a":failed Unknown PEi386 section name `.drectve' GHCi 7.4.1 high 7.8.3 thoughtpolice new Jul 7, 2012
#7068 Extensive Memory usage (regression) Compiler 7.4.1 high 7.8.3 simonpj new Jul 11, 2012
#7097 linker fails to load package with binding to foreign library Runtime System 7.4.2 high 7.8.3 new Jul 25, 2012
#7143 ghc-7.6.0.20120810-x86_64-windows.exe -> ghc can't figure out LLVM version Compiler (LLVM) 7.6.1-rc1 high 7.8.3 dterei new Aug 14, 2012
#7152 Add flag to configure that skips overwriting of symlinks on install Build System 7.4.2 high 7.8.3 thoughtpolice new Aug 15, 2012
#7198 New codegen more than doubles compile time of T3294 Compiler 7.4.2 high 7.8.3 simonmar new Aug 29, 2012
#7200 template-haskell-2.7.0.0 fails to build with GHC 7.0.4 due to missing pragma Template Haskell 7.0.4 high 7.8.3 duncan new Aug 29, 2012
#7273 Binary size increase in nofib/grep between 7.6.1 and HEAD Compiler 7.6.1 high 7.8.3 new Sep 28, 2012
#7289 Mingw FPU init not Windows compatible. Runtime System 7.2.2 high 7.8.3 new Oct 2, 2012
#7298 Test 2228 fails with dynamic-by-default GHCi 7.6.1 high 7.8.3 new Oct 5, 2012
#7411 Exceptions are optimized away in certain situations Compiler 7.6.1 high 7.8.3 new Nov 13, 2012
#7428 GHC compile times are seriously non-linear in program size Compiler 7.4.2 high 7.8.3 new Nov 19, 2012
#7452 [GNU gold] ld: error: cannot find [...]/Types__1.o Build System 7.6.1 high 7.8.3 new Nov 26, 2012
#7490 ghc-stage1 panic when building a cross-compiler or cross-building a compiler Compiler 7.7 high 7.8.3 new Dec 8, 2012
#7521 Simplifier ticks exhausted when compiling Accelerate example. Compiler 7.6.1 high 7.8.3 new Dec 21, 2012
#7567 invalidateModSummaryCache throws exception if ms_hs_date is 0 Compiler 7.6.1 high 7.8.3 new Jan 10, 2013
#7598 ghc-stage1 generates wrong assembler on StgCmmPrim (operand out of range) Compiler 7.7 high 7.8.3 new Jan 16, 2013
#7651 Buiding GHC with parallel IO manager freezes on Mac (not on FreeBSD) Build System 7.7 high 7.8.3 new Feb 2, 2013
#7679 Regression in -fregs-graph performance Compiler (NCG) 7.6.2 high 7.8.3 new Feb 11, 2013
#7919 Heap corruption (segfault) from large 'let' expression Runtime System 7.6.3 high 7.8.3 infoneeded May 17, 2013
#8224 Excessive system time -- new IO manager problem? Runtime System 7.7 high 7.8.3 new Sep 4, 2013
#8303 defer StackOverflow exceptions (rather than dropping them) when exceptions are masked Runtime System 7.7 high 7.8.3 thoughtpolice new Sep 15, 2013
#8362 Filesystem related tests failed on solaris (SmartOS) libraries (other) 7.6.3 high 7.8.3 new Sep 26, 2013
#8366 haskeline Posix backend needs #include <sys/termios.h> on Solaris libraries (other) 7.7 high 7.8.3 thoughtpolice infoneeded Sep 26, 2013
#8475 Library docs: broken links to Foreign.ForeignPtr Documentation 7.6.3 high 7.8.3 hellertime infoneeded Oct 24, 2013
#8498 gcc hardcoded in build scripts! (ignores the --with-gcc= flag in configure) Compiler 7.7 high 7.8.3 merge Nov 2, 2013
#8736 GHCi doesn't load .dyn_o files appropriately Compiler 7.8.1-rc2 high 7.8.3 thoughtpolice new Feb 4, 2014
#8746 Crosscompiling Compiler 7.8.1-rc1 high 7.8.3 new Feb 7, 2014
#8935 Obscure linker bug leads to crash in GHCi Runtime System 7.8.1-rc2 high 7.8.3 simonmar new Mar 28, 2014
#8974 64 bit windows executable built with ghc-7.9.20140405+LLVM segfaults Compiler (LLVM) 7.9 high 7.8.3 new Apr 8, 2014
#9007 fails to build with hardening flags enabled (relocation R_X86_64_32 against `stg_CHARLIKE_closure'...) Compiler 7.9 high 7.8.3 simonmar new Apr 17, 2014
#8115 GHC 64-bit Windows build failures with LLVM Compiler 7.6.3 highest new Aug 5, 2013
#5987 Too many symbols in ghc package DLL Compiler 7.5 highest 7.8.3 thoughtpolice new Apr 3, 2012
#7478 setSessionDynFlags does not always work Compiler 7.7 highest 7.8.3 new Dec 4, 2012
#7602 Threaded RTS performing badly on recent OS X (10.8?) Runtime System highest 7.8.3 thoughtpolice new Jan 17, 2013
#8228 GHC built under Windows does not generate dyn_hi files Compiler 7.7 highest 7.8.3 thoughtpolice new Sep 5, 2013
#8376 Static Executable + GHC API (+ Dynamic Linking?) gives Segfault Compiler 7.7 highest 7.8.3 thoughtpolice new Sep 28, 2013
#9001 unexpected runtime crash Runtime System 7.8.2 highest 7.8.3 simonmar new Apr 16, 2014
#8159 Uses of Binary decode should have a proper error message Compiler 7.6.3 low new Aug 23, 2013
#8173 GHC uses nub Compiler 7.6.3 low leroux new Aug 26, 2013
#8195 Different floating point results with -msse2 on 32bit Linux Compiler (NCG) 7.7 low new Aug 29, 2013
#8399 Of Bird tacks and non-blank blank lines Compiler 7.6.3 low new Oct 2, 2013
#8447 A combination of type-level comparison and subtraction does not work for 0 Compiler (Type checker) 7.6.3 low new Oct 15, 2013
#8520 ghc.exe: internal error: loadArchive: error whilst reading `C' Compiler 7.7 low new Nov 11, 2013
#8532 Hyperbolic arc cosine fails on (-1) :: Complex r. libraries/base 7.6.3 low new Nov 14, 2013
#8539 Data.Complex shouldn't use default implementation of (**) Prelude 7.6.3 low new Nov 18, 2013
#8619 Support anonymous string literals in C-- (OR) give better ASSERT failure messages in C-- Compiler 7.7 low new Dec 20, 2013
#8672 :browse and roles on typefamilies Compiler (Type checker) 7.7 low goldfire new Jan 16, 2014
#8710 Overlapping patterns warning misplaced Compiler 7.7 low new Jan 28, 2014
#8730 Invalid Unicode Codepoints in Char Compiler 7.6.3 low new Feb 3, 2014
#8780 abs for IEEE floating point is slightly wrong. Compiler 7.6.3 low new Feb 13, 2014
#8873 /cygdrive/c/Program Files (x86)/Haskell Platform/2013.2.0.0/bin/ghcii-7.6.3.sh/../ghc: No such file or directory GHCi 7.6.3 low new Mar 11, 2014
#8902 Test for RTLD_NEXT, RTLD_DEFAULT broken on Linux libraries/unix 7.8.1-rc2 low new Mar 16, 2014
#8904 haddock displays GHC.Types.Coercible as a datatype GHC API 7.9 low new Mar 16, 2014
#8959 GHCi should honour UnicodeSyntax Compiler 7.6.3 low new Apr 5, 2014
#8983 sync-all get should respect branches Build System 7.9 low new Apr 10, 2014
#5063 unix package has untracked dependency on libbsd libraries/unix 7.0.3 low 7.10.1 trommler new Mar 29, 2011
#8156 amd64 + in-tree gmp build broken Build System 7.7 low 7.10.1 patch Aug 22, 2013
#1498 Optimisation: eliminate unnecessary heap check in recursive function Compiler 6.6.1 low normal 7.6.2 new Jul 6, 2007
#2401 aborting an STM transaction should throw an exception Runtime System 6.8.3 low normal 7.6.2 new Jun 28, 2008
#3184 package.conf should be under /var, not /usr Package system 6.10.2 low normal 7.6.2 new Apr 21, 2009
1 2 3 4 5 6 7 8 9
Note: See TracReports for help on using and creating reports.