Custom Query (6599 matches)

Filters
 
Or
 
  
 
Columns

Show under each result:


Results (901 - 1000 of 6599)

1 2 3 4 5 6 7 8 9 10 11 12 13 14 15 16 17 18 19 20

Resolution: fixed (100 matches)

Ticket Summary Owner Type Priority Milestone Component
#3550 Dynamic libraries don't work on Mac OS/X igloo bug high 6.12.3 Compiler
#7806 Dynamic linking and libffi bug normal Build System
#8266 Dynamic linking on Mac bug highest 7.8.1 Build System
#4424 Dynamically set -hide-all-packages is being ignored. simonmar bug normal Compiler
#3480 Easily make Typeable keys pure, so that Typeable can be handled efficiently across communications task normal 7.2.1 libraries/base
#4908 Easy SpecConstr opportunity that is nonetheless missed bug normal Compiler
#5719 Empty tuple doesn't have kind Constraint bug normal Compiler
#3572 Empty types are prettyprinted with trailing "=" igloo merge normal Template Haskell
#4220 EmptyDataDecls + DeriveFunctor == Panic! simonpj bug normal 7.0.1 Compiler
#3850 EmptyDataDecls and type context igloo merge normal Compiler
#2798 Enable "rec" keyword when RecursiveDo is enabled? igloo task high 7.0.1 Compiler
#7868 Enable -funbox-strict-small-fields by default feature request normal Compiler
#7769 Enable Opt_PIC for the dyn way regardless of OSes bug normal Compiler
#3879 Enable shared libraries on Windows benl feature request high 7.0.1 Compiler
#4862 Enable usage of gold linker with GHC igloo feature request normal 7.4.3 Compiler
#8084 Enabling PolyKinds makes some type errors weird bug normal Compiler (Type checker)
#3963 Entered absent arg bug low 7.0.1 Compiler
#2510 Environment modification during installation should be optional feature request normal None
#2157 Equality Constraints with Type Families chak feature request normal 6.10 branch Compiler (Type checker)
#3418 Equality constraint causes ghc panic chak bug normal Compiler
#2715 Equality constraint in superclass not supported chak task low 7.2.1 Compiler (Type checker)
#7524 Erroneous repeated kind variable in conflicting type family instance error message bug normal Compiler
#2059 Erroneous results in trigonometric functions for > double-precision values igloo bug normal 6.8.3 Compiler
#3299 Error building HEAD on OS X: missing gmp.h igloo bug normal 6.12.1 Compiler
#2424 Error compiling Crypto-4.1.0 on ghc-6.8.3 bug normal 6.10.1 Compiler
#7004 Error compiling repa-algorithms with LLVM dterei bug normal Compiler (LLVM)
#4365 Error handle in readProcess not closed simonmar bug normal 7.0.1 libraries/process
#732 Error in shutdownHaskell() in Win32 DLL bug normal 6.4.2 Runtime System
#8612 Error message "not in scope" on missing 'deriving' bug low Compiler
#2636 Error message for missing import substantially worse in 6.9/6.11 igloo merge high 6.10.1 Compiler
#5847 Error message trying to use SOE bug normal Compiler
#3848 Error message typo in rts/RtsAPI.c igloo merge high 6.12.2 Runtime System
#7800 Error message when deriving Typeable without PolyKinds bug normal 7.8.1 Compiler
#5084 Error message with INLINE/SPECIALISE pragma for class method feature request normal Compiler
#3156 Error on +RTS kHugeNumber simonmar bug normal 6.12.1 Runtime System
#3469 Error open file if name contain national symbol bug high 6.12.1 libraries/base
#3501 Error thunks not being exposed with "B" strictness bug normal 6.14 branch Compiler
#3448 Error with .so files in HEAD snapshot distribution igloo bug high 6.12.1 Build System
#7059 Error: junk `naughty I386 byte register' after expression bug normal 7.6.1 Compiler
#7830 Error: operand out of range bug highest 7.8.1 Compiler
#3579 Error: symbol `Bug_compose1_closure' is already defined igloo merge high 6.12.1 Compiler
#2409 Error: symbol `ghczmprim_GHCziUnit_Z0T_closure' is already defined bug normal 6.10.1 Compiler
#3329 Errors Building 6.10.3 on NetBSD 4.0 bug normal 6.12.1 Compiler
#3592 Eta-contraction gives a rather bogus type error message simonpj bug normal 7.4.1 Compiler (Type checker)
#7382 Evaluating GHCi expressions is slow following the dynamic-by-default change Austin Seipp <aseipp@…> bug highest 7.8.1 GHCi
#4476 Event log header: Startup event length wrong simonmar bug normal 7.0.2 Runtime System
#4512 EventLog does not play well with forkProcess simonmar bug high 7.0.2 Runtime System
#2939 Example in library doco for Control.Exception.handle is no longer supported in GHC 6.10 bug normal Documentation
#2902 Example where ghc 6.10.1 fails to optimize recursive instance function calls igloo bug low 7.2.1 Compiler
#2963 Exception if current path has national symbols igloo merge normal 6.10.2 libraries/directory
#3086 Exception if temp path has national symbols igloo merge normal 6.10.2 libraries/directory
#3189 Exception in canonicalizePath if path has national symbols simonmar bug normal 6.12.1 libraries/directory
#1704 Exception when using the :list command in the GHCI debugger igloo bug high 6.8.1 GHCi
#588 Exception: Time.toClockTime: picoseconds out of range bug normal 6.4.2 libraries/base
#8492 Exception: expectJust cpeBody:collect_args bug normal Compiler
#2747 Excessive Memory Usage: space leak with foldl' on Integer igloo merge normal 6.10.2 Runtime System
#2762 Excessive heap usage igloo bug low 7.2.1 Compiler
#5929 Exciting arity warning when compiling with optimizations bug normal Compiler
#8801 Exclude extralibs from sdist bug normal 7.8.1 Build System
#2466 Execution time mis-accounting bug high 7.4.1 Profiling
#7347 Existential data constructors should not be promoted bug normal Compiler
#8714 ExistentialQuantification plus DeriveDataTypeable leads to core lint error bug highest 7.8.1 Compiler
#5402 Exit code is wrong with dynamically loaded libraries bug normal 7.2.2 Runtime System
#5358 Exotic form of kind ghc-prim:GHC.Prim.?{(w) tc 34g} bug normal 7.4.1 Template Haskell
#2591 Explain +RTS -t/s/S output text igloo bug normal 6.10.1 Documentation
#7268 Explicit type signatures for top level record pattern matches polymorphism fail bug normal 7.8.1 Compiler (Type checker)
#323 Exponential behaviour with type synonyms simonpj bug low Compiler (Type checker)
#6048 Exponential inlining code blowup bug normal Compiler
#4422 Export String from Data.String proposal normal Not GHC libraries/base
#8200 Export languageExtensions from DynFlags jstolarek feature request normal GHC API
#2769 Export mapAccumR from Data.Map, Data.IntMap proposal normal Not GHC libraries (other)
#8878 Export runTcInteractive from TcRnDriver holzensp feature request lowest 7.8.1 Compiler
#1384 Exporting a module that isn't imported doesn't fail igloo bug high 6.8.1 Compiler
#4478 Exporting the same entity twice should not be a warning bug normal 7.4.1 Compiler
#8172 Expose CWD and import search paths in GHCi via new `:show paths` command hvr feature request normal 7.8.1 GHCi
#5933 Expose GHCI_TABLES_NEXT_TO_CODE in some header file simonmar feature request normal 7.6.1 Build System
#7683 Expose tcIfaceExpr feature request normal GHC API
#2998 Expose the internals of the network library to make it more extensible igloo proposal normal Not GHC libraries (other)
#8533 Extend new getPhysicalMemorySize ifdef to ios_HOST_OS bug high 7.8.1 Compiler
#2419 Extensible exceptions proposal normal Not GHC libraries/base
#1491 Extension RecordWildCards is broken igloo bug normal 6.8 branch Compiler
#16 Extensionsflags igloo feature request normal 6.8.1 Compiler
#5952 Extra ' in error output concerning promoted kinds bug normal Compiler (Type checker)
#3411 Extra file in snapshots from HEAD branch bug normal None
#2601 Extra parens in error message's displayed code bug normal Compiler
#4107 Extra parens in error message's displayed code bug normal Compiler
#8349 Extra space in CFLAGS for libffi includes bug normal 7.8.1 Build System
#8041 Extraction of Uniques is in some places done inefficiently bug normal Compiler
#8474 Extremely slow compilation of a program with multiply implicit parameters bug normal Compiler (Type checker)
#1783 FD leads to non-termination of type checker bug normal Compiler (Type checker)
#7630 FFI: "capi" calling convention doesn't work bug normal Compiler
#1533 FFI: exporting the same thing multiple times fails: error: redefinition of ‘stginit_export_ShouldCompile_zdfdiv’ simonmar bug high 6.8.1 Compiler (FFI)
#4914 FPU initialization required again simonmar bug high 7.2.1 Compiler (NCG)
#4326 Failed building GHC - Error linking on OS X igloo bug highest 7.0.1 Build System
#7976 Failure building master (perf) on i686-pc-linux-gnu bug normal Compiler
#2847 Failure on OPTION_* pramgas other than GHC igloo bug high 6.10.2 Compiler
#7903 Failure to find class instance specified with extra parentheses bug normal Compiler
#7176 Failure to let kind variable remain uninstantiated when not needed bug normal Compiler
#8574 Failure to require FlexibleContexts bug normal Compiler (Parser)
#5935 Failure to resolve AnyK bug normal Compiler (Type checker)
(more results for this group on next page)
1 2 3 4 5 6 7 8 9 10 11 12 13 14 15 16 17 18 19 20
Note: See TracQuery for help on using queries.