Ticket #9524: make.log

File make.log, 3.2 KB (added by Kritzefitz, 3 years ago)
Line 
1===--- building phase 0
2make -r --no-print-directory -f ghc.mk phase=0 phase_0_builds
3utils/ghc-pkg/ghc.mk:46: warning: overriding recipe for target 'install_utils/ghc-pkg_dist_wrapper'
4utils/ghc-pkg/ghc.mk:37: warning: ignoring old recipe for target 'install_utils/ghc-pkg_dist_wrapper'
5make[1]: Nothing to be done for 'phase_0_builds'.
6===--- building phase 1
7make -r --no-print-directory -f ghc.mk phase=1 phase_1_builds
8libraries/hpc/ghc.mk:3: libraries/hpc/dist-boot/build/.depend-v.haskell: Datei oder Verzeichnis nicht gefunden
9compiler/ghc.mk:639: compiler/stage1/build/.depend-v.haskell: Datei oder Verzeichnis nicht gefunden
10utils/ghc-pkg/ghc.mk:46: warning: overriding recipe for target 'install_utils/ghc-pkg_dist_wrapper'
11utils/ghc-pkg/ghc.mk:37: warning: ignoring old recipe for target 'install_utils/ghc-pkg_dist_wrapper'
12"/usr/bin/ghc" -o utils/hsc2hs/dist/build/tmp/hsc2hs -hisuf hi -osuf  o -hcsuf hc -static  -H64m -O0  -package-db libraries/bootstrapping.conf  -hide-all-packages -i -iutils/hsc2hs/. -iutils/hsc2hs/dist/build -iutils/hsc2hs/dist/build/autogen -Iutils/hsc2hs/dist/build -Iutils/hsc2hs/dist/build/autogen     -optP-include -optPutils/hsc2hs/dist/build/autogen/cabal_macros.h -package base-4.6.0.1 -package containers-0.5.0.0 -package directory-1.2.0.1 -package filepath-1.3.0.1 -package process-1.1.0.2 -XHaskell98 -XCPP -XForeignFunctionInterface  -no-user-package-db -rtsopts      -odir utils/hsc2hs/dist/build -hidir utils/hsc2hs/dist/build -stubdir utils/hsc2hs/dist/build   -optl-L'/usr/lib/ghc/process-1.1.0.2' -optl-L'/usr/lib/ghc/directory-1.2.0.1' -optl-L'/usr/lib/ghc/unix-2.6.0.1' -optl-L'/usr/lib/ghc/time-1.4.0.1' -optl-L'/usr/lib/ghc/old-locale-1.0.0.5' -optl-L'/usr/lib/ghc/filepath-1.3.0.1' -optl-L'/usr/lib/ghc/containers-0.5.0.0' -optl-L'/usr/lib/ghc/bytestring-0.10.0.2' -optl-L'/usr/lib/ghc/deepseq-1.3.0.1' -optl-L'/usr/lib/ghc/array-0.4.0.1' -optl-L'/usr/lib/ghc/base-4.6.0.1' -optl-L'/usr/lib/ghc/integer-gmp-0.5.0.0' -optl-L'/usr/lib/ghc/ghc-prim-0.3.0.0' -optl-L'/usr/lib/ghc' -optl-lrt -optl-lutil -optl-ldl -optl-lpthread -optl-lgmp -optl-lffi -optl-lm -optl-lrt -optl-ldl -static  -H64m -O0  -package-db libraries/bootstrapping.conf  -hide-all-packages -i -iutils/hsc2hs/. -iutils/hsc2hs/dist/build -iutils/hsc2hs/dist/build/autogen -Iutils/hsc2hs/dist/build -Iutils/hsc2hs/dist/build/autogen     -optP-include -optPutils/hsc2hs/dist/build/autogen/cabal_macros.h -package base-4.6.0.1 -package containers-0.5.0.0 -package directory-1.2.0.1 -package filepath-1.3.0.1 -package process-1.1.0.2 -XHaskell98 -XCPP -XForeignFunctionInterface  -no-user-package-db -rtsopts      utils/hsc2hs/dist/build/Main.o utils/hsc2hs/dist/build/HSCParser.o utils/hsc2hs/dist/build/DirectCodegen.o utils/hsc2hs/dist/build/CrossCodegen.o utils/hsc2hs/dist/build/UtilsCodegen.o utils/hsc2hs/dist/build/Common.o utils/hsc2hs/dist/build/C.o utils/hsc2hs/dist/build/Flags.o utils/hsc2hs/dist/build/Paths_hsc2hs.o   
13utils/hsc2hs/dist/build/Main.o: In function `s2nI_info':
14(.text+0x5c5): undefined reference to `GetModuleFileNameW'
15collect2: error: ld returned 1 exit status
16utils/hsc2hs/ghc.mk:15: recipe for target 'utils/hsc2hs/dist/build/tmp/hsc2hs' failed
17make[1]: *** [utils/hsc2hs/dist/build/tmp/hsc2hs] Error 1
18Makefile:64: recipe for target 'all' failed
19make: *** [all] Error 2