Ticket #3763: build.log

File build.log, 7.4 KB (added by michalt, 4 years ago)

The build log.

Line 
1===--- updating makefiles phase 0
2make -r --no-print-directory -f ghc.mk phase=0 just-makefiles
3utils/unlit/ghc.mk:18: utils/unlit/dist/build/.depend: No such file or directory
4utils/hp2ps/ghc.mk:21: utils/hp2ps/dist/build/.depend: No such file or directory
5utils/genprimopcode/ghc.mk:16: utils/genprimopcode/dist/build/.depend: No such file or directory
6includes/ghc.mk:130: includes/dist-derivedconstants/build/.depend: No such file or directory
7includes/ghc.mk:159: includes/dist-ghcconstants/build/.depend: No such file or directory
8rts/ghc.mk:334: rts/dist/build/.depend-v-p-dyn-l-debug-thr-thr_debug-thr_l-thr_p-debug_dyn-thr_dyn-thr_debug_dyn: No such file or directory
9utils/ghc-cabal/ghc.mk:95: utils/ghc-cabal/dist-dummy-ghc/build/.depend: No such file or directory
10utils/genapply/ghc.mk:26: utils/genapply/dist/build/.depend: No such file or directory
11utils/haddock/ghc.mk:20: utils/haddock/dist/package-data.mk: No such file or directory
12libraries/ghc-prim/ghc.mk:3: libraries/ghc-prim/dist-install/package-data.mk: No such file or directory
13libraries/integer-gmp/ghc.mk:3: libraries/integer-gmp/dist-install/package-data.mk: No such file or directory
14libraries/base/ghc.mk:3: libraries/base/dist-install/package-data.mk: No such file or directory
15libraries/filepath/ghc.mk:3: libraries/filepath/dist-install/package-data.mk: No such file or directory
16libraries/array/ghc.mk:3: libraries/array/dist-install/package-data.mk: No such file or directory
17libraries/bytestring/ghc.mk:3: libraries/bytestring/dist-install/package-data.mk: No such file or directory
18libraries/containers/ghc.mk:3: libraries/containers/dist-install/package-data.mk: No such file or directory
19libraries/unix/ghc.mk:3: libraries/unix/dist-install/package-data.mk: No such file or directory
20libraries/old-locale/ghc.mk:3: libraries/old-locale/dist-install/package-data.mk: No such file or directory
21libraries/old-time/ghc.mk:3: libraries/old-time/dist-install/package-data.mk: No such file or directory
22libraries/time/ghc.mk:3: libraries/time/dist-install/package-data.mk: No such file or directory
23libraries/directory/ghc.mk:3: libraries/directory/dist-install/package-data.mk: No such file or directory
24libraries/process/ghc.mk:3: libraries/process/dist-install/package-data.mk: No such file or directory
25libraries/random/ghc.mk:3: libraries/random/dist-install/package-data.mk: No such file or directory
26libraries/extensible-exceptions/ghc.mk:3: libraries/extensible-exceptions/dist-install/package-data.mk: No such file or directory
27libraries/haskell98/ghc.mk:3: libraries/haskell98/dist-install/package-data.mk: No such file or directory
28libraries/hpc/ghc.mk:3: libraries/hpc/dist-install/package-data.mk: No such file or directory
29libraries/pretty/ghc.mk:3: libraries/pretty/dist-install/package-data.mk: No such file or directory
30libraries/syb/ghc.mk:3: libraries/syb/dist-install/package-data.mk: No such file or directory
31libraries/template-haskell/ghc.mk:3: libraries/template-haskell/dist-install/package-data.mk: No such file or directory
32libraries/base3-compat/ghc.mk:3: libraries/base3-compat/dist-install/package-data.mk: No such file or directory
33libraries/Cabal/ghc.mk:3: libraries/Cabal/dist-install/package-data.mk: No such file or directory
34libraries/ghc-binary/ghc.mk:3: libraries/ghc-binary/dist-install/package-data.mk: No such file or directory
35libraries/bin-package-db/ghc.mk:3: libraries/bin-package-db/dist-install/package-data.mk: No such file or directory
36libraries/mtl/ghc.mk:3: libraries/mtl/dist-install/package-data.mk: No such file or directory
37libraries/utf8-string/ghc.mk:3: libraries/utf8-string/dist-install/package-data.mk: No such file or directory
38libraries/terminfo/ghc.mk:3: libraries/terminfo/dist-install/package-data.mk: No such file or directory
39libraries/haskeline/ghc.mk:3: libraries/haskeline/dist-install/package-data.mk: No such file or directory
40libraries/dph/dph-base/ghc.mk:3: libraries/dph/dph-base/dist-install/package-data.mk: No such file or directory
41libraries/dph/dph-prim-interface/ghc.mk:3: libraries/dph/dph-prim-interface/dist-install/package-data.mk: No such file or directory
42libraries/dph/dph-prim-seq/ghc.mk:3: libraries/dph/dph-prim-seq/dist-install/package-data.mk: No such file or directory
43libraries/dph/dph-prim-par/ghc.mk:3: libraries/dph/dph-prim-par/dist-install/package-data.mk: No such file or directory
44ghc.mk:616: libraries/dph/dph-seq/ghc.mk: No such file or directory
45ghc.mk:616: libraries/dph/dph-par/ghc.mk: No such file or directory
46compiler/ghc.mk:457: compiler/stage1/package-data.mk: No such file or directory
47compiler/ghc.mk:458: compiler/stage2/package-data.mk: No such file or directory
48utils/hsc2hs/ghc.mk:14: utils/hsc2hs/dist/package-data.mk: No such file or directory
49utils/hsc2hs/ghc.mk:15: utils/hsc2hs/dist-install/package-data.mk: No such file or directory
50ghc.mk:672: libraries/hpc/dist-boot/package-data.mk: No such file or directory
51ghc.mk:673: libraries/extensible-exceptions/dist-boot/package-data.mk: No such file or directory
52ghc.mk:674: libraries/Cabal/dist-boot/package-data.mk: No such file or directory
53ghc.mk:675: libraries/ghc-binary/dist-boot/package-data.mk: No such file or directory
54ghc.mk:676: libraries/bin-package-db/dist-boot/package-data.mk: No such file or directory
55mkdir inplace
56mkdir inplace/bin
57"rm" -f utils/ghc-pkg/Version.hs
58mkdir inplace/lib
59"rm" -f includes/ghcplatform.h
60Creating includes/ghcautoconf.h...
61echo "module Version where"                    >> utils/ghc-pkg/Version.hs
62"rm" -f -f inplace/bin/mkdirhier
63"rm" -f compiler/main/Config.hs
64rm -rf libraries/dph/dph-par libraries/dph/dph-par.tmp
65rm -rf libraries/dph/dph-seq libraries/dph/dph-seq.tmp
66Creating includes/ghcplatform.h...
67echo "version, targetOS, targetARCH :: String" >> utils/ghc-pkg/Version.hs
68echo '#!/bin/sh'                 >> inplace/bin/mkdirhier
69mkdir libraries/dph/dph-par.tmp
70mkdir libraries/dph/dph-seq.tmp
71"inplace/bin/mkdirhier" rts/dist/build/sm/
72"inplace/bin/mkdirhier" rts/dist/build/sm/
73cp libraries/dph/dph-common/Setup.hs libraries/dph/dph-par.tmp/Setup.hs
74cp libraries/dph/dph-common/Setup.hs libraries/dph/dph-seq.tmp/Setup.hs
75Creating compiler/main/Config.hs ...
76echo "version    = \"6.12.3\""      >> utils/ghc-pkg/Version.hs
77cat utils/mkdirhier/mkdirhier.sh >> inplace/bin/mkdirhier
78cp libraries/dph/dph-common/LICENSE libraries/dph/dph-par.tmp/LICENSE
79/bin/sh: inplace/bin/mkdirhier: Permission denied
80/bin/sh: inplace/bin/mkdirhier: Permission denied
81make[1]: *** [rts/dist/build/sm/Evac_thr.c] Error 126
82make[1]: *** Waiting for unfinished jobs....
83make[1]: *** [rts/dist/build/sm/Scav_thr.c] Error 126
84cp libraries/dph/dph-common/LICENSE libraries/dph/dph-seq.tmp/LICENSE
85echo "targetOS   = \"linux\""        >> utils/ghc-pkg/Version.hs
86chmod +x inplace/bin/mkdirhier
87sed "s/DPHWAY/par/g" libraries/dph/dph-common/dph-common.cabal > libraries/dph/dph-par.tmp/dph-par.cabal
88sed "s/DPHWAY/seq/g" libraries/dph/dph-common/dph-common.cabal > libraries/dph/dph-seq.tmp/dph-seq.cabal
89echo "targetARCH = \"x86_64\""      >> utils/ghc-pkg/Version.hs
90sed "s/common/par/g" libraries/dph/dph-common/ghc.mk > libraries/dph/dph-par.tmp/ghc.mk
91sed "s/common/seq/g" libraries/dph/dph-common/ghc.mk > libraries/dph/dph-seq.tmp/ghc.mk
92Done.
93sed "s/common/par/g" libraries/dph/dph-common/GNUmakefile > libraries/dph/dph-par.tmp/GNUmakefile
94sed "s/common/seq/g" libraries/dph/dph-common/GNUmakefile > libraries/dph/dph-seq.tmp/GNUmakefile
95mv libraries/dph/dph-par.tmp libraries/dph/dph-par
96mv libraries/dph/dph-seq.tmp libraries/dph/dph-seq
97Done.
98done.
99make: *** [all] Error 2