Ticket #3137: make.output

File make.output, 48.0 KB (added by mvanier, 5 years ago)

Output of make when compiling GHC 6.10.2

Line 
1grep: packages: No such file or directory
2make -C libraries boot
3rm -f -rf ifBuildable
4mkdir ifBuildable
5cp ifBuildable.hs ifBuildable/
6cd ifBuildable && /usr/bin/ghc -Wall --make ifBuildable -o ifBuildable
7[1 of 1] Compiling Main             ( ifBuildable.hs, ifBuildable.o )
8Linking ifBuildable ...
9mkdir bootstrapping
10/usr/bin/ghc -Wall -DCABAL_VERSION=1,6,0,3 -odir /Users/mvanier/_/src/ghc/ghc-6.10.2/libraries/bootstrapping -hidir /Users/mvanier/_/src/ghc/ghc-6.10.2/libraries/bootstrapping -i/Users/mvanier/_/src/ghc/ghc-6.10.2/libraries/Cabal -i/Users/mvanier/_/src/ghc/ghc-6.10.2/libraries/filepath -i/Users/mvanier/_/src/ghc/ghc-6.10.2/libraries/hpc --make cabal-bin -o cabal-bin
11
12/Users/mvanier/_/src/ghc/ghc-6.10.2/libraries/Cabal/Distribution/Simple/Utils.hs:1:11:
13    Warning: -fffi is deprecated: use -XForeignFunctionInterface or pragma {-# LANGUAGE ForeignFunctionInterface#-} instead
14
15/Users/mvanier/_/src/ghc/ghc-6.10.2/libraries/Cabal/Distribution/Simple/Utils.hs:4:15:
16    Warning: -fffi is deprecated: use -XForeignFunctionInterface or pragma {-# LANGUAGE ForeignFunctionInterface#-} instead
17
18/Users/mvanier/_/src/ghc/ghc-6.10.2/libraries/Cabal/Distribution/Simple/InstallDirs.hs:1:11:
19    Warning: -fffi is deprecated: use -XForeignFunctionInterface or pragma {-# LANGUAGE ForeignFunctionInterface#-} instead
20
21/Users/mvanier/_/src/ghc/ghc-6.10.2/libraries/Cabal/Distribution/Simple/InstallDirs.hs:4:15:
22    Warning: -fffi is deprecated: use -XForeignFunctionInterface or pragma {-# LANGUAGE ForeignFunctionInterface#-} instead
23[ 1 of 55] Compiling System.FilePath.Windows ( /Users/mvanier/_/src/ghc/ghc-6.10.2/libraries/filepath/System/FilePath/Windows.hs, /Users/mvanier/_/src/ghc/ghc-6.10.2/libraries/bootstrapping/System/FilePath/Windows.o )
24[ 2 of 55] Compiling System.FilePath.Posix ( /Users/mvanier/_/src/ghc/ghc-6.10.2/libraries/filepath/System/FilePath/Posix.hs, /Users/mvanier/_/src/ghc/ghc-6.10.2/libraries/bootstrapping/System/FilePath/Posix.o )
25[ 3 of 55] Compiling System.FilePath  ( /Users/mvanier/_/src/ghc/ghc-6.10.2/libraries/filepath/System/FilePath.hs, /Users/mvanier/_/src/ghc/ghc-6.10.2/libraries/bootstrapping/System/FilePath.o )
26[ 4 of 55] Compiling Distribution.Simple.GHC.Makefile ( /Users/mvanier/_/src/ghc/ghc-6.10.2/libraries/Cabal/Distribution/Simple/GHC/Makefile.hs, /Users/mvanier/_/src/ghc/ghc-6.10.2/libraries/bootstrapping/Distribution/Simple/GHC/Makefile.o )
27[ 5 of 55] Compiling Distribution.Compat.Permissions ( /Users/mvanier/_/src/ghc/ghc-6.10.2/libraries/Cabal/Distribution/Compat/Permissions.hs, /Users/mvanier/_/src/ghc/ghc-6.10.2/libraries/bootstrapping/Distribution/Compat/Permissions.o )
28[ 6 of 55] Compiling Distribution.Compat.Exception ( /Users/mvanier/_/src/ghc/ghc-6.10.2/libraries/Cabal/Distribution/Compat/Exception.hs, /Users/mvanier/_/src/ghc/ghc-6.10.2/libraries/bootstrapping/Distribution/Compat/Exception.o )
29[ 7 of 55] Compiling Distribution.Compat.TempFile ( /Users/mvanier/_/src/ghc/ghc-6.10.2/libraries/Cabal/Distribution/Compat/TempFile.hs, /Users/mvanier/_/src/ghc/ghc-6.10.2/libraries/bootstrapping/Distribution/Compat/TempFile.o )
30[ 8 of 55] Compiling Distribution.Compat.CopyFile ( /Users/mvanier/_/src/ghc/ghc-6.10.2/libraries/Cabal/Distribution/Compat/CopyFile.hs, /Users/mvanier/_/src/ghc/ghc-6.10.2/libraries/bootstrapping/Distribution/Compat/CopyFile.o )
31[ 9 of 55] Compiling Distribution.GetOpt ( /Users/mvanier/_/src/ghc/ghc-6.10.2/libraries/Cabal/Distribution/GetOpt.hs, /Users/mvanier/_/src/ghc/ghc-6.10.2/libraries/bootstrapping/Distribution/GetOpt.o )
32[10 of 55] Compiling Distribution.Compat.ReadP ( /Users/mvanier/_/src/ghc/ghc-6.10.2/libraries/Cabal/Distribution/Compat/ReadP.hs, /Users/mvanier/_/src/ghc/ghc-6.10.2/libraries/bootstrapping/Distribution/Compat/ReadP.o )
33[11 of 55] Compiling Distribution.Text ( /Users/mvanier/_/src/ghc/ghc-6.10.2/libraries/Cabal/Distribution/Text.hs, /Users/mvanier/_/src/ghc/ghc-6.10.2/libraries/bootstrapping/Distribution/Text.o )
34[12 of 55] Compiling Distribution.Version ( /Users/mvanier/_/src/ghc/ghc-6.10.2/libraries/Cabal/Distribution/Version.hs, /Users/mvanier/_/src/ghc/ghc-6.10.2/libraries/bootstrapping/Distribution/Version.o )
35[13 of 55] Compiling Language.Haskell.Extension ( /Users/mvanier/_/src/ghc/ghc-6.10.2/libraries/Cabal/Language/Haskell/Extension.hs, /Users/mvanier/_/src/ghc/ghc-6.10.2/libraries/bootstrapping/Language/Haskell/Extension.o )
36[14 of 55] Compiling Distribution.System ( /Users/mvanier/_/src/ghc/ghc-6.10.2/libraries/Cabal/Distribution/System.hs, /Users/mvanier/_/src/ghc/ghc-6.10.2/libraries/bootstrapping/Distribution/System.o )
37[15 of 55] Compiling Distribution.Simple.PreProcess.Unlit ( /Users/mvanier/_/src/ghc/ghc-6.10.2/libraries/Cabal/Distribution/Simple/PreProcess/Unlit.hs, /Users/mvanier/_/src/ghc/ghc-6.10.2/libraries/bootstrapping/Distribution/Simple/PreProcess/Unlit.o )
38[16 of 55] Compiling Distribution.ReadE ( /Users/mvanier/_/src/ghc/ghc-6.10.2/libraries/Cabal/Distribution/ReadE.hs, /Users/mvanier/_/src/ghc/ghc-6.10.2/libraries/bootstrapping/Distribution/ReadE.o )
39[17 of 55] Compiling Distribution.Verbosity ( /Users/mvanier/_/src/ghc/ghc-6.10.2/libraries/Cabal/Distribution/Verbosity.hs, /Users/mvanier/_/src/ghc/ghc-6.10.2/libraries/bootstrapping/Distribution/Verbosity.o )
40[18 of 55] Compiling Distribution.Package ( /Users/mvanier/_/src/ghc/ghc-6.10.2/libraries/Cabal/Distribution/Package.hs, /Users/mvanier/_/src/ghc/ghc-6.10.2/libraries/bootstrapping/Distribution/Package.o )
41[19 of 55] Compiling Distribution.ModuleName ( /Users/mvanier/_/src/ghc/ghc-6.10.2/libraries/Cabal/Distribution/ModuleName.hs, /Users/mvanier/_/src/ghc/ghc-6.10.2/libraries/bootstrapping/Distribution/ModuleName.o )
42[20 of 55] Compiling Distribution.Simple.Utils ( /Users/mvanier/_/src/ghc/ghc-6.10.2/libraries/Cabal/Distribution/Simple/Utils.hs, /Users/mvanier/_/src/ghc/ghc-6.10.2/libraries/bootstrapping/Distribution/Simple/Utils.o )
43[21 of 55] Compiling Distribution.Simple.PackageIndex ( /Users/mvanier/_/src/ghc/ghc-6.10.2/libraries/Cabal/Distribution/Simple/PackageIndex.hs, /Users/mvanier/_/src/ghc/ghc-6.10.2/libraries/bootstrapping/Distribution/Simple/PackageIndex.o )
44[22 of 55] Compiling Distribution.Simple.Program ( /Users/mvanier/_/src/ghc/ghc-6.10.2/libraries/Cabal/Distribution/Simple/Program.hs, /Users/mvanier/_/src/ghc/ghc-6.10.2/libraries/bootstrapping/Distribution/Simple/Program.o )
45[23 of 55] Compiling Distribution.License ( /Users/mvanier/_/src/ghc/ghc-6.10.2/libraries/Cabal/Distribution/License.hs, /Users/mvanier/_/src/ghc/ghc-6.10.2/libraries/bootstrapping/Distribution/License.o )
46[24 of 55] Compiling Distribution.Compiler ( /Users/mvanier/_/src/ghc/ghc-6.10.2/libraries/Cabal/Distribution/Compiler.hs, /Users/mvanier/_/src/ghc/ghc-6.10.2/libraries/bootstrapping/Distribution/Compiler.o )
47[25 of 55] Compiling Distribution.PackageDescription ( /Users/mvanier/_/src/ghc/ghc-6.10.2/libraries/Cabal/Distribution/PackageDescription.hs, /Users/mvanier/_/src/ghc/ghc-6.10.2/libraries/bootstrapping/Distribution/PackageDescription.o )
48[26 of 55] Compiling Distribution.PackageDescription.Configuration ( /Users/mvanier/_/src/ghc/ghc-6.10.2/libraries/Cabal/Distribution/PackageDescription/Configuration.hs, /Users/mvanier/_/src/ghc/ghc-6.10.2/libraries/bootstrapping/Distribution/PackageDescription/Configuration.o )
49[27 of 55] Compiling Distribution.PackageDescription.Check ( /Users/mvanier/_/src/ghc/ghc-6.10.2/libraries/Cabal/Distribution/PackageDescription/Check.hs, /Users/mvanier/_/src/ghc/ghc-6.10.2/libraries/bootstrapping/Distribution/PackageDescription/Check.o )
50[28 of 55] Compiling Distribution.ParseUtils ( /Users/mvanier/_/src/ghc/ghc-6.10.2/libraries/Cabal/Distribution/ParseUtils.hs, /Users/mvanier/_/src/ghc/ghc-6.10.2/libraries/bootstrapping/Distribution/ParseUtils.o )
51[29 of 55] Compiling Distribution.InstalledPackageInfo ( /Users/mvanier/_/src/ghc/ghc-6.10.2/libraries/Cabal/Distribution/InstalledPackageInfo.hs, /Users/mvanier/_/src/ghc/ghc-6.10.2/libraries/bootstrapping/Distribution/InstalledPackageInfo.o )
52[30 of 55] Compiling Distribution.Simple.GHC.IPI642 ( /Users/mvanier/_/src/ghc/ghc-6.10.2/libraries/Cabal/Distribution/Simple/GHC/IPI642.hs, /Users/mvanier/_/src/ghc/ghc-6.10.2/libraries/bootstrapping/Distribution/Simple/GHC/IPI642.o )
53[31 of 55] Compiling Distribution.Simple.GHC.IPI641 ( /Users/mvanier/_/src/ghc/ghc-6.10.2/libraries/Cabal/Distribution/Simple/GHC/IPI641.hs, /Users/mvanier/_/src/ghc/ghc-6.10.2/libraries/bootstrapping/Distribution/Simple/GHC/IPI641.o )
54[32 of 55] Compiling Distribution.PackageDescription.Parse ( /Users/mvanier/_/src/ghc/ghc-6.10.2/libraries/Cabal/Distribution/PackageDescription/Parse.hs, /Users/mvanier/_/src/ghc/ghc-6.10.2/libraries/bootstrapping/Distribution/PackageDescription/Parse.o )
55[33 of 55] Compiling Distribution.Simple.Command ( /Users/mvanier/_/src/ghc/ghc-6.10.2/libraries/Cabal/Distribution/Simple/Command.hs, /Users/mvanier/_/src/ghc/ghc-6.10.2/libraries/bootstrapping/Distribution/Simple/Command.o )
56[34 of 55] Compiling Distribution.Simple.Compiler ( /Users/mvanier/_/src/ghc/ghc-6.10.2/libraries/Cabal/Distribution/Simple/Compiler.hs, /Users/mvanier/_/src/ghc/ghc-6.10.2/libraries/bootstrapping/Distribution/Simple/Compiler.o )
57[35 of 55] Compiling Distribution.Simple.InstallDirs ( /Users/mvanier/_/src/ghc/ghc-6.10.2/libraries/Cabal/Distribution/Simple/InstallDirs.hs, /Users/mvanier/_/src/ghc/ghc-6.10.2/libraries/bootstrapping/Distribution/Simple/InstallDirs.o )
58[36 of 55] Compiling Distribution.Simple.Setup ( /Users/mvanier/_/src/ghc/ghc-6.10.2/libraries/Cabal/Distribution/Simple/Setup.hs, /Users/mvanier/_/src/ghc/ghc-6.10.2/libraries/bootstrapping/Distribution/Simple/Setup.o )
59[37 of 55] Compiling Distribution.Make ( /Users/mvanier/_/src/ghc/ghc-6.10.2/libraries/Cabal/Distribution/Make.hs, /Users/mvanier/_/src/ghc/ghc-6.10.2/libraries/bootstrapping/Distribution/Make.o )
60[38 of 55] Compiling Distribution.Simple.LocalBuildInfo ( /Users/mvanier/_/src/ghc/ghc-6.10.2/libraries/Cabal/Distribution/Simple/LocalBuildInfo.hs, /Users/mvanier/_/src/ghc/ghc-6.10.2/libraries/bootstrapping/Distribution/Simple/LocalBuildInfo.o )
61[39 of 55] Compiling Distribution.Simple.Build.Macros ( /Users/mvanier/_/src/ghc/ghc-6.10.2/libraries/Cabal/Distribution/Simple/Build/Macros.hs, /Users/mvanier/_/src/ghc/ghc-6.10.2/libraries/bootstrapping/Distribution/Simple/Build/Macros.o )
62[40 of 55] Compiling Distribution.Simple.BuildPaths ( /Users/mvanier/_/src/ghc/ghc-6.10.2/libraries/Cabal/Distribution/Simple/BuildPaths.hs, /Users/mvanier/_/src/ghc/ghc-6.10.2/libraries/bootstrapping/Distribution/Simple/BuildPaths.o )
63[41 of 55] Compiling Distribution.Simple.Build.PathsModule ( /Users/mvanier/_/src/ghc/ghc-6.10.2/libraries/Cabal/Distribution/Simple/Build/PathsModule.hs, /Users/mvanier/_/src/ghc/ghc-6.10.2/libraries/bootstrapping/Distribution/Simple/Build/PathsModule.o )
64[42 of 55] Compiling Distribution.Simple.GHC ( /Users/mvanier/_/src/ghc/ghc-6.10.2/libraries/Cabal/Distribution/Simple/GHC.hs, /Users/mvanier/_/src/ghc/ghc-6.10.2/libraries/bootstrapping/Distribution/Simple/GHC.o )
65[43 of 55] Compiling Distribution.Simple.JHC ( /Users/mvanier/_/src/ghc/ghc-6.10.2/libraries/Cabal/Distribution/Simple/JHC.hs, /Users/mvanier/_/src/ghc/ghc-6.10.2/libraries/bootstrapping/Distribution/Simple/JHC.o )
66[44 of 55] Compiling Distribution.Simple.NHC ( /Users/mvanier/_/src/ghc/ghc-6.10.2/libraries/Cabal/Distribution/Simple/NHC.hs, /Users/mvanier/_/src/ghc/ghc-6.10.2/libraries/bootstrapping/Distribution/Simple/NHC.o )
67[45 of 55] Compiling Distribution.Simple.PreProcess ( /Users/mvanier/_/src/ghc/ghc-6.10.2/libraries/Cabal/Distribution/Simple/PreProcess.hs, /Users/mvanier/_/src/ghc/ghc-6.10.2/libraries/bootstrapping/Distribution/Simple/PreProcess.o )
68[46 of 55] Compiling Distribution.Simple.Hugs ( /Users/mvanier/_/src/ghc/ghc-6.10.2/libraries/Cabal/Distribution/Simple/Hugs.hs, /Users/mvanier/_/src/ghc/ghc-6.10.2/libraries/bootstrapping/Distribution/Simple/Hugs.o )
69[47 of 55] Compiling Distribution.Simple.Build ( /Users/mvanier/_/src/ghc/ghc-6.10.2/libraries/Cabal/Distribution/Simple/Build.hs, /Users/mvanier/_/src/ghc/ghc-6.10.2/libraries/bootstrapping/Distribution/Simple/Build.o )
70[48 of 55] Compiling Distribution.Simple.Haddock ( /Users/mvanier/_/src/ghc/ghc-6.10.2/libraries/Cabal/Distribution/Simple/Haddock.hs, /Users/mvanier/_/src/ghc/ghc-6.10.2/libraries/bootstrapping/Distribution/Simple/Haddock.o )
71[49 of 55] Compiling Distribution.Simple.Install ( /Users/mvanier/_/src/ghc/ghc-6.10.2/libraries/Cabal/Distribution/Simple/Install.hs, /Users/mvanier/_/src/ghc/ghc-6.10.2/libraries/bootstrapping/Distribution/Simple/Install.o )
72[50 of 55] Compiling Distribution.Simple.Register ( /Users/mvanier/_/src/ghc/ghc-6.10.2/libraries/Cabal/Distribution/Simple/Register.hs, /Users/mvanier/_/src/ghc/ghc-6.10.2/libraries/bootstrapping/Distribution/Simple/Register.o )
73[51 of 55] Compiling Distribution.Simple.Configure ( /Users/mvanier/_/src/ghc/ghc-6.10.2/libraries/Cabal/Distribution/Simple/Configure.hs, /Users/mvanier/_/src/ghc/ghc-6.10.2/libraries/bootstrapping/Distribution/Simple/Configure.o )
74[52 of 55] Compiling Distribution.Simple.SrcDist ( /Users/mvanier/_/src/ghc/ghc-6.10.2/libraries/Cabal/Distribution/Simple/SrcDist.hs, /Users/mvanier/_/src/ghc/ghc-6.10.2/libraries/bootstrapping/Distribution/Simple/SrcDist.o )
75[53 of 55] Compiling Distribution.Simple.UserHooks ( /Users/mvanier/_/src/ghc/ghc-6.10.2/libraries/Cabal/Distribution/Simple/UserHooks.hs, /Users/mvanier/_/src/ghc/ghc-6.10.2/libraries/bootstrapping/Distribution/Simple/UserHooks.o )
76[54 of 55] Compiling Distribution.Simple ( /Users/mvanier/_/src/ghc/ghc-6.10.2/libraries/Cabal/Distribution/Simple.hs, /Users/mvanier/_/src/ghc/ghc-6.10.2/libraries/bootstrapping/Distribution/Simple.o )
77[55 of 55] Compiling Main             ( cabal-bin.hs, /Users/mvanier/_/src/ghc/ghc-6.10.2/libraries/bootstrapping/Main.o )
78Linking cabal-bin ...
79echo "[]" > bootstrapping.conf.tmp
80cd extensible-exceptions && /Users/mvanier/_/src/ghc/ghc-6.10.2/libraries/cabal-bin /usr/bin/ghc /Users/mvanier/_/src/ghc/ghc-6.10.2/libraries/bootstrapping.conf 1.6.0.3 clean     --distpref=dist-bootstrapping
81cleaning...
82cd extensible-exceptions && /Users/mvanier/_/src/ghc/ghc-6.10.2/libraries/cabal-bin /usr/bin/ghc /Users/mvanier/_/src/ghc/ghc-6.10.2/libraries/bootstrapping.conf 1.6.0.3 configure --distpref=dist-bootstrapping --with-compiler=/usr/bin/ghc --with-hc-pkg=/usr/bin/ghc-pkg --package-db=/Users/mvanier/_/src/ghc/ghc-6.10.2/libraries/bootstrapping.conf.tmp
83Configuring extensible-exceptions-0.1.0.1...
84cd extensible-exceptions && /Users/mvanier/_/src/ghc/ghc-6.10.2/libraries/cabal-bin /usr/bin/ghc /Users/mvanier/_/src/ghc/ghc-6.10.2/libraries/bootstrapping.conf 1.6.0.3 build     --distpref=dist-bootstrapping
85Preprocessing library extensible-exceptions-0.1.0.1...
86Building extensible-exceptions-0.1.0.1...
87[1 of 1] Compiling Control.Exception.Extensible ( Control/Exception/Extensible.hs, dist-bootstrapping/build/Control/Exception/Extensible.o )
88ar: creating archive dist-bootstrapping/build/libHSextensible-exceptions-0.1.0.1.a
89cd extensible-exceptions && /Users/mvanier/_/src/ghc/ghc-6.10.2/libraries/cabal-bin /usr/bin/ghc /Users/mvanier/_/src/ghc/ghc-6.10.2/libraries/bootstrapping.conf 1.6.0.3 install   --distpref=dist-bootstrapping --inplace
90Installing library in
91/Users/mvanier/_/src/ghc/ghc-6.10.2/libraries/extensible-exceptions/dist-bootstrapping/install/usr/local/lib/extensible-exceptions-0.1.0.1/ghc-6.10.1
92Registering extensible-exceptions-0.1.0.1...
93Reading package info from "dist-bootstrapping/inplace-pkg-config" ... done.
94Writing new package config file... done.
95cd filepath && /Users/mvanier/_/src/ghc/ghc-6.10.2/libraries/cabal-bin /usr/bin/ghc /Users/mvanier/_/src/ghc/ghc-6.10.2/libraries/bootstrapping.conf 1.6.0.3 clean     --distpref=dist-bootstrapping
96cleaning...
97cd filepath && /Users/mvanier/_/src/ghc/ghc-6.10.2/libraries/cabal-bin /usr/bin/ghc /Users/mvanier/_/src/ghc/ghc-6.10.2/libraries/bootstrapping.conf 1.6.0.3 configure --distpref=dist-bootstrapping --with-compiler=/usr/bin/ghc --with-hc-pkg=/usr/bin/ghc-pkg --package-db=/Users/mvanier/_/src/ghc/ghc-6.10.2/libraries/bootstrapping.conf.tmp
98Configuring filepath-1.1.0.2...
99cd filepath && /Users/mvanier/_/src/ghc/ghc-6.10.2/libraries/cabal-bin /usr/bin/ghc /Users/mvanier/_/src/ghc/ghc-6.10.2/libraries/bootstrapping.conf 1.6.0.3 build     --distpref=dist-bootstrapping
100Preprocessing library filepath-1.1.0.2...
101Building filepath-1.1.0.2...
102[1 of 3] Compiling System.FilePath.Windows ( System/FilePath/Windows.hs, dist-bootstrapping/build/System/FilePath/Windows.o )
103[2 of 3] Compiling System.FilePath.Posix ( System/FilePath/Posix.hs, dist-bootstrapping/build/System/FilePath/Posix.o )
104[3 of 3] Compiling System.FilePath  ( System/FilePath.hs, dist-bootstrapping/build/System/FilePath.o )
105ar: creating archive dist-bootstrapping/build/libHSfilepath-1.1.0.2.a
106cd filepath && /Users/mvanier/_/src/ghc/ghc-6.10.2/libraries/cabal-bin /usr/bin/ghc /Users/mvanier/_/src/ghc/ghc-6.10.2/libraries/bootstrapping.conf 1.6.0.3 install   --distpref=dist-bootstrapping --inplace
107Installing library in
108/Users/mvanier/_/src/ghc/ghc-6.10.2/libraries/filepath/dist-bootstrapping/install/usr/local/lib/filepath-1.1.0.2/ghc-6.10.1
109Registering filepath-1.1.0.2...
110Reading package info from "dist-bootstrapping/inplace-pkg-config" ... done.
111Writing new package config file... done.
112cd Cabal    && /Users/mvanier/_/src/ghc/ghc-6.10.2/libraries/cabal-bin /usr/bin/ghc /Users/mvanier/_/src/ghc/ghc-6.10.2/libraries/bootstrapping.conf 1.6.0.3 clean     --distpref=dist-bootstrapping
113cleaning...
114cd Cabal    && /Users/mvanier/_/src/ghc/ghc-6.10.2/libraries/cabal-bin /usr/bin/ghc /Users/mvanier/_/src/ghc/ghc-6.10.2/libraries/bootstrapping.conf 1.6.0.3 configure --distpref=dist-bootstrapping --with-compiler=/usr/bin/ghc --with-hc-pkg=/usr/bin/ghc-pkg --package-db=/Users/mvanier/_/src/ghc/ghc-6.10.2/libraries/bootstrapping.conf.tmp
115Configuring Cabal-1.6.0.3...
116Warning: This package indirectly depends on multiple versions of the same
117package. This is highly likely to cause a compile failure.
118package process-1.0.1.0 requires filepath-1.1.0.1
119package directory-1.0.0.2 requires filepath-1.1.0.1
120package Cabal-1.6.0.3 requires filepath-1.1.0.2
121cd Cabal    && /Users/mvanier/_/src/ghc/ghc-6.10.2/libraries/cabal-bin /usr/bin/ghc /Users/mvanier/_/src/ghc/ghc-6.10.2/libraries/bootstrapping.conf 1.6.0.3 build     --distpref=dist-bootstrapping
122Preprocessing library Cabal-1.6.0.3...
123Building Cabal-1.6.0.3...
124
125Distribution/Simple/InstallDirs.hs:1:11:
126    Warning: -fffi is deprecated: use -XForeignFunctionInterface or pragma {-# LANGUAGE ForeignFunctionInterface#-} instead
127
128Distribution/Simple/InstallDirs.hs:4:15:
129    Warning: -fffi is deprecated: use -XForeignFunctionInterface or pragma {-# LANGUAGE ForeignFunctionInterface#-} instead
130
131Distribution/Simple/Utils.hs:1:11:
132    Warning: -fffi is deprecated: use -XForeignFunctionInterface or pragma {-# LANGUAGE ForeignFunctionInterface#-} instead
133
134Distribution/Simple/Utils.hs:4:15:
135    Warning: -fffi is deprecated: use -XForeignFunctionInterface or pragma {-# LANGUAGE ForeignFunctionInterface#-} instead
136[ 1 of 51] Compiling Distribution.Simple.GHC.Makefile ( Distribution/Simple/GHC/Makefile.hs, dist-bootstrapping/build/Distribution/Simple/GHC/Makefile.o )
137[ 2 of 51] Compiling Distribution.Compat.Permissions ( Distribution/Compat/Permissions.hs, dist-bootstrapping/build/Distribution/Compat/Permissions.o )
138[ 3 of 51] Compiling Distribution.Compat.Exception ( Distribution/Compat/Exception.hs, dist-bootstrapping/build/Distribution/Compat/Exception.o )
139[ 4 of 51] Compiling Distribution.Compat.TempFile ( Distribution/Compat/TempFile.hs, dist-bootstrapping/build/Distribution/Compat/TempFile.o )
140[ 5 of 51] Compiling Distribution.Compat.CopyFile ( Distribution/Compat/CopyFile.hs, dist-bootstrapping/build/Distribution/Compat/CopyFile.o )
141[ 6 of 51] Compiling Distribution.GetOpt ( Distribution/GetOpt.hs, dist-bootstrapping/build/Distribution/GetOpt.o )
142[ 7 of 51] Compiling Distribution.Compat.ReadP ( Distribution/Compat/ReadP.hs, dist-bootstrapping/build/Distribution/Compat/ReadP.o )
143[ 8 of 51] Compiling Distribution.Text ( Distribution/Text.hs, dist-bootstrapping/build/Distribution/Text.o )
144[ 9 of 51] Compiling Distribution.Version ( Distribution/Version.hs, dist-bootstrapping/build/Distribution/Version.o )
145[10 of 51] Compiling Language.Haskell.Extension ( Language/Haskell/Extension.hs, dist-bootstrapping/build/Language/Haskell/Extension.o )
146[11 of 51] Compiling Distribution.System ( Distribution/System.hs, dist-bootstrapping/build/Distribution/System.o )
147[12 of 51] Compiling Distribution.Simple.PreProcess.Unlit ( Distribution/Simple/PreProcess/Unlit.hs, dist-bootstrapping/build/Distribution/Simple/PreProcess/Unlit.o )
148[13 of 51] Compiling Distribution.ReadE ( Distribution/ReadE.hs, dist-bootstrapping/build/Distribution/ReadE.o )
149[14 of 51] Compiling Distribution.Verbosity ( Distribution/Verbosity.hs, dist-bootstrapping/build/Distribution/Verbosity.o )
150[15 of 51] Compiling Distribution.Package ( Distribution/Package.hs, dist-bootstrapping/build/Distribution/Package.o )
151[16 of 51] Compiling Distribution.ModuleName ( Distribution/ModuleName.hs, dist-bootstrapping/build/Distribution/ModuleName.o )
152[17 of 51] Compiling Distribution.Simple.Utils ( Distribution/Simple/Utils.hs, dist-bootstrapping/build/Distribution/Simple/Utils.o )
153[18 of 51] Compiling Distribution.Simple.PackageIndex ( Distribution/Simple/PackageIndex.hs, dist-bootstrapping/build/Distribution/Simple/PackageIndex.o )
154[19 of 51] Compiling Distribution.Simple.Program ( Distribution/Simple/Program.hs, dist-bootstrapping/build/Distribution/Simple/Program.o )
155[20 of 51] Compiling Distribution.License ( Distribution/License.hs, dist-bootstrapping/build/Distribution/License.o )
156[21 of 51] Compiling Distribution.Compiler ( Distribution/Compiler.hs, dist-bootstrapping/build/Distribution/Compiler.o )
157[22 of 51] Compiling Distribution.PackageDescription ( Distribution/PackageDescription.hs, dist-bootstrapping/build/Distribution/PackageDescription.o )
158[23 of 51] Compiling Distribution.PackageDescription.Configuration ( Distribution/PackageDescription/Configuration.hs, dist-bootstrapping/build/Distribution/PackageDescription/Configuration.o )
159[24 of 51] Compiling Distribution.PackageDescription.Check ( Distribution/PackageDescription/Check.hs, dist-bootstrapping/build/Distribution/PackageDescription/Check.o )
160[25 of 51] Compiling Distribution.ParseUtils ( Distribution/ParseUtils.hs, dist-bootstrapping/build/Distribution/ParseUtils.o )
161[26 of 51] Compiling Distribution.InstalledPackageInfo ( Distribution/InstalledPackageInfo.hs, dist-bootstrapping/build/Distribution/InstalledPackageInfo.o )
162[27 of 51] Compiling Distribution.Simple.GHC.IPI642 ( Distribution/Simple/GHC/IPI642.hs, dist-bootstrapping/build/Distribution/Simple/GHC/IPI642.o )
163[28 of 51] Compiling Distribution.Simple.GHC.IPI641 ( Distribution/Simple/GHC/IPI641.hs, dist-bootstrapping/build/Distribution/Simple/GHC/IPI641.o )
164[29 of 51] Compiling Distribution.PackageDescription.Parse ( Distribution/PackageDescription/Parse.hs, dist-bootstrapping/build/Distribution/PackageDescription/Parse.o )
165[30 of 51] Compiling Distribution.Simple.Command ( Distribution/Simple/Command.hs, dist-bootstrapping/build/Distribution/Simple/Command.o )
166[31 of 51] Compiling Distribution.Simple.Compiler ( Distribution/Simple/Compiler.hs, dist-bootstrapping/build/Distribution/Simple/Compiler.o )
167[32 of 51] Compiling Distribution.Simple.InstallDirs ( Distribution/Simple/InstallDirs.hs, dist-bootstrapping/build/Distribution/Simple/InstallDirs.o )
168[33 of 51] Compiling Distribution.Simple.Setup ( Distribution/Simple/Setup.hs, dist-bootstrapping/build/Distribution/Simple/Setup.o )
169[34 of 51] Compiling Distribution.Make ( Distribution/Make.hs, dist-bootstrapping/build/Distribution/Make.o )
170[35 of 51] Compiling Distribution.Simple.LocalBuildInfo ( Distribution/Simple/LocalBuildInfo.hs, dist-bootstrapping/build/Distribution/Simple/LocalBuildInfo.o )
171[36 of 51] Compiling Distribution.Simple.Build.Macros ( Distribution/Simple/Build/Macros.hs, dist-bootstrapping/build/Distribution/Simple/Build/Macros.o )
172[37 of 51] Compiling Distribution.Simple.BuildPaths ( Distribution/Simple/BuildPaths.hs, dist-bootstrapping/build/Distribution/Simple/BuildPaths.o )
173[38 of 51] Compiling Distribution.Simple.Build.PathsModule ( Distribution/Simple/Build/PathsModule.hs, dist-bootstrapping/build/Distribution/Simple/Build/PathsModule.o )
174[39 of 51] Compiling Distribution.Simple.GHC ( Distribution/Simple/GHC.hs, dist-bootstrapping/build/Distribution/Simple/GHC.o )
175[40 of 51] Compiling Distribution.Simple.JHC ( Distribution/Simple/JHC.hs, dist-bootstrapping/build/Distribution/Simple/JHC.o )
176[41 of 51] Compiling Distribution.Simple.NHC ( Distribution/Simple/NHC.hs, dist-bootstrapping/build/Distribution/Simple/NHC.o )
177[42 of 51] Compiling Distribution.Simple.PreProcess ( Distribution/Simple/PreProcess.hs, dist-bootstrapping/build/Distribution/Simple/PreProcess.o )
178[43 of 51] Compiling Distribution.Simple.Hugs ( Distribution/Simple/Hugs.hs, dist-bootstrapping/build/Distribution/Simple/Hugs.o )
179[44 of 51] Compiling Distribution.Simple.Build ( Distribution/Simple/Build.hs, dist-bootstrapping/build/Distribution/Simple/Build.o )
180[45 of 51] Compiling Distribution.Simple.Haddock ( Distribution/Simple/Haddock.hs, dist-bootstrapping/build/Distribution/Simple/Haddock.o )
181[46 of 51] Compiling Distribution.Simple.Install ( Distribution/Simple/Install.hs, dist-bootstrapping/build/Distribution/Simple/Install.o )
182[47 of 51] Compiling Distribution.Simple.Register ( Distribution/Simple/Register.hs, dist-bootstrapping/build/Distribution/Simple/Register.o )
183[48 of 51] Compiling Distribution.Simple.Configure ( Distribution/Simple/Configure.hs, dist-bootstrapping/build/Distribution/Simple/Configure.o )
184[49 of 51] Compiling Distribution.Simple.SrcDist ( Distribution/Simple/SrcDist.hs, dist-bootstrapping/build/Distribution/Simple/SrcDist.o )
185[50 of 51] Compiling Distribution.Simple.UserHooks ( Distribution/Simple/UserHooks.hs, dist-bootstrapping/build/Distribution/Simple/UserHooks.o )
186[51 of 51] Compiling Distribution.Simple ( Distribution/Simple.hs, dist-bootstrapping/build/Distribution/Simple.o )
187ar: creating archive dist-bootstrapping/build/libHSCabal-1.6.0.3.a
188cd Cabal    && /Users/mvanier/_/src/ghc/ghc-6.10.2/libraries/cabal-bin /usr/bin/ghc /Users/mvanier/_/src/ghc/ghc-6.10.2/libraries/bootstrapping.conf 1.6.0.3 install   --distpref=dist-bootstrapping --inplace
189Installing library in
190/Users/mvanier/_/src/ghc/ghc-6.10.2/libraries/Cabal/dist-bootstrapping/install/usr/local/lib/Cabal-1.6.0.3/ghc-6.10.1
191Registering Cabal-1.6.0.3...
192Reading package info from "dist-bootstrapping/inplace-pkg-config" ... done.
193Writing new package config file... done.
194cd hpc    && /Users/mvanier/_/src/ghc/ghc-6.10.2/libraries/cabal-bin /usr/bin/ghc /Users/mvanier/_/src/ghc/ghc-6.10.2/libraries/bootstrapping.conf 1.6.0.3 clean     --distpref=dist-bootstrapping
195cleaning...
196cd hpc    && /Users/mvanier/_/src/ghc/ghc-6.10.2/libraries/cabal-bin /usr/bin/ghc /Users/mvanier/_/src/ghc/ghc-6.10.2/libraries/bootstrapping.conf 1.6.0.3 configure --distpref=dist-bootstrapping --with-compiler=/usr/bin/ghc --with-hc-pkg=/usr/bin/ghc-pkg --package-db=/Users/mvanier/_/src/ghc/ghc-6.10.2/libraries/bootstrapping.conf.tmp
197Configuring hpc-0.5.0.3...
198cd hpc    && /Users/mvanier/_/src/ghc/ghc-6.10.2/libraries/cabal-bin /usr/bin/ghc /Users/mvanier/_/src/ghc/ghc-6.10.2/libraries/bootstrapping.conf 1.6.0.3 build     --distpref=dist-bootstrapping
199Preprocessing library hpc-0.5.0.3...
200Building hpc-0.5.0.3...
201[1 of 4] Compiling Trace.Hpc.Util   ( Trace/Hpc/Util.hs, dist-bootstrapping/build/Trace/Hpc/Util.o )
202[2 of 4] Compiling Trace.Hpc.Tix    ( Trace/Hpc/Tix.hs, dist-bootstrapping/build/Trace/Hpc/Tix.o )
203[3 of 4] Compiling Trace.Hpc.Mix    ( Trace/Hpc/Mix.hs, dist-bootstrapping/build/Trace/Hpc/Mix.o )
204[4 of 4] Compiling Trace.Hpc.Reflect ( dist-bootstrapping/build/Trace/Hpc/Reflect.hs, dist-bootstrapping/build/Trace/Hpc/Reflect.o )
205ar: creating archive dist-bootstrapping/build/libHShpc-0.5.0.3.a
206cd hpc    && /Users/mvanier/_/src/ghc/ghc-6.10.2/libraries/cabal-bin /usr/bin/ghc /Users/mvanier/_/src/ghc/ghc-6.10.2/libraries/bootstrapping.conf 1.6.0.3 install   --distpref=dist-bootstrapping --inplace
207Installing library in
208/Users/mvanier/_/src/ghc/ghc-6.10.2/libraries/hpc/dist-bootstrapping/install/usr/local/lib/hpc-0.5.0.3/ghc-6.10.1
209Registering hpc-0.5.0.3...
210Reading package info from "dist-bootstrapping/inplace-pkg-config" ... done.
211Writing new package config file... done.
212mv bootstrapping.conf.tmp bootstrapping.conf
213make -C gmp       all
214make -C gmpbuild MAKEFLAGS=
215make  all-recursive
216Making all in tests
217Making all in .
218make[5]: Nothing to be done for `all-am'.
219Making all in devel
220make[5]: Nothing to be done for `all'.
221Making all in mpn
222make[5]: Nothing to be done for `all'.
223Making all in mpz
224make[5]: Nothing to be done for `all'.
225Making all in mpq
226make[5]: Nothing to be done for `all'.
227Making all in mpf
228make[5]: Nothing to be done for `all'.
229Making all in rand
230make[5]: Nothing to be done for `all'.
231Making all in misc
232make[5]: Nothing to be done for `all'.
233Making all in cxx
234make[5]: Nothing to be done for `all'.
235Making all in mpbsd
236make[5]: Nothing to be done for `all'.
237Making all in mpn
238make[4]: Nothing to be done for `all'.
239Making all in mpz
240make[4]: Nothing to be done for `all'.
241Making all in mpq
242make[4]: Nothing to be done for `all'.
243Making all in mpf
244make[4]: Nothing to be done for `all'.
245Making all in printf
246make[4]: Nothing to be done for `all'.
247Making all in scanf
248make[4]: Nothing to be done for `all'.
249Making all in cxx
250make[4]: Nothing to be done for `all'.
251Making all in mpbsd
252make[4]: Nothing to be done for `all'.
253Making all in demos
254Making all in calc
255make  all-am
256make[6]: Nothing to be done for `all-am'.
257Making all in expr
258make[5]: Nothing to be done for `all'.
259make[5]: Nothing to be done for `all-am'.
260Making all in tune
261make[4]: Nothing to be done for `all'.
262Making all in doc
263make[4]: Nothing to be done for `all-am'.
264cp gmpbuild/.libs/libgmp.a .
265ranlib libgmp.a
266ranlib: file: libgmp.a(mp_clz_tab.o) has no symbols
267ranlib: file: libgmp.a(obprintf.o) has no symbols
268ranlib: file: libgmp.a(obvprintf.o) has no symbols
269ranlib: file: libgmp.a(obprntffuns.o) has no symbols
270ranlib: file: libgmp.a(repl-vsnprintf.o) has no symbols
271make -C libffi    all
272rm -f -rf libffi-3.0.8 build
273/usr/bin/tar -zxf libffi-3.0.8.tar.gz
274mv libffi-3.0.8 build
275chmod +x ln
276PATH=`pwd`:$PATH; \
277            export PATH; \
278            cd build && \
279            CC=gcc /bin/sh configure \
280                  --enable-static=yes \
281                  --enable-shared=no \
282                  --host=i386-apple-darwin --build=i386-apple-darwin
283checking build system type... i386-apple-darwin
284checking host system type... i386-apple-darwin
285checking target system type... i386-apple-darwin
286checking for a BSD-compatible install... /usr/bin/install -c
287checking whether build environment is sane... yes
288checking for a thread-safe mkdir -p... ./install-sh -c -d
289checking for gawk... gawk
290checking whether make sets $(MAKE)... yes
291checking for i386-apple-darwin-gcc... gcc
292checking for C compiler default output file name... a.out
293checking whether the C compiler works... yes
294checking whether we are cross compiling... no
295checking for suffix of executables...
296checking for suffix of object files... o
297checking whether we are using the GNU C compiler... yes
298checking whether gcc accepts -g... yes
299checking for gcc option to accept ISO C89... none needed
300checking for style of include used by make... GNU
301checking dependency style of gcc... gcc3
302checking dependency style of gcc... gcc3
303checking whether gcc and cc understand -c and -o together... yes
304checking for a sed that does not truncate output... /usr/bin/sed
305checking for grep that handles long lines and -e... /usr/bin/grep
306checking for egrep... /usr/bin/grep -E
307checking for ld used by gcc... /usr/libexec/gcc/i686-apple-darwin9/4.0.1/ld
308checking if the linker (/usr/libexec/gcc/i686-apple-darwin9/4.0.1/ld) is GNU ld... no
309checking for /usr/libexec/gcc/i686-apple-darwin9/4.0.1/ld option to reload object files... -r
310checking for BSD-compatible nm... /usr/bin/nm -p
311checking whether ln -s works... no, using cp -p
312checking how to recognize dependent libraries... pass_all
313checking how to run the C preprocessor... gcc -E
314checking for ANSI C header files... yes
315checking for sys/types.h... yes
316checking for sys/stat.h... yes
317checking for stdlib.h... yes
318checking for string.h... yes
319checking for memory.h... yes
320checking for strings.h... yes
321checking for inttypes.h... yes
322checking for stdint.h... yes
323checking for unistd.h... yes
324checking dlfcn.h usability... yes
325checking dlfcn.h presence... yes
326checking for dlfcn.h... yes
327checking for i386-apple-darwin-g++... no
328checking for i386-apple-darwin-c++... no
329checking for i386-apple-darwin-gpp... no
330checking for i386-apple-darwin-aCC... no
331checking for i386-apple-darwin-CC... no
332checking for i386-apple-darwin-cxx... no
333checking for i386-apple-darwin-cc++... no
334checking for i386-apple-darwin-cl.exe... no
335checking for i386-apple-darwin-FCC... no
336checking for i386-apple-darwin-KCC... no
337checking for i386-apple-darwin-RCC... no
338checking for i386-apple-darwin-xlC_r... no
339checking for i386-apple-darwin-xlC... no
340checking for g++... g++
341checking whether we are using the GNU C++ compiler... yes
342checking whether g++ accepts -g... yes
343checking dependency style of g++... gcc3
344checking how to run the C++ preprocessor... g++ -E
345checking for i386-apple-darwin-g77... no
346checking for i386-apple-darwin-xlf... no
347checking for i386-apple-darwin-f77... no
348checking for i386-apple-darwin-frt... no
349checking for i386-apple-darwin-pgf77... no
350checking for i386-apple-darwin-cf77... no
351checking for i386-apple-darwin-fort77... no
352checking for i386-apple-darwin-fl32... no
353checking for i386-apple-darwin-af77... no
354checking for i386-apple-darwin-xlf90... no
355checking for i386-apple-darwin-f90... no
356checking for i386-apple-darwin-pgf90... no
357checking for i386-apple-darwin-pghpf... no
358checking for i386-apple-darwin-epcf90... no
359checking for i386-apple-darwin-gfortran... no
360checking for i386-apple-darwin-g95... no
361checking for i386-apple-darwin-xlf95... no
362checking for i386-apple-darwin-f95... no
363checking for i386-apple-darwin-fort... no
364checking for i386-apple-darwin-ifort... no
365checking for i386-apple-darwin-ifc... no
366checking for i386-apple-darwin-efc... no
367checking for i386-apple-darwin-pgf95... no
368checking for i386-apple-darwin-lf95... no
369checking for i386-apple-darwin-ftn... no
370checking for g77... no
371checking for xlf... no
372checking for f77... no
373checking for frt... no
374checking for pgf77... no
375checking for cf77... no
376checking for fort77... no
377checking for fl32... no
378checking for af77... no
379checking for xlf90... no
380checking for f90... no
381checking for pgf90... no
382checking for pghpf... no
383checking for epcf90... no
384checking for gfortran... no
385checking for g95... no
386checking for xlf95... no
387checking for f95... no
388checking for fort... no
389checking for ifort... no
390checking for ifc... no
391checking for efc... no
392checking for pgf95... no
393checking for lf95... no
394checking for ftn... no
395checking whether we are using the GNU Fortran 77 compiler... no
396checking whether  accepts -g... no
397checking the maximum length of command line arguments... 196608
398checking command to parse /usr/bin/nm -p output from gcc object... ok
399checking for objdir... .libs
400checking for i386-apple-darwin-ar... no
401checking for ar... ar
402checking for i386-apple-darwin-ranlib... no
403checking for ranlib... ranlib
404checking for i386-apple-darwin-strip... no
405checking for strip... strip
406checking for i386-apple-darwin-dsymutil... no
407checking for dsymutil... dsymutil
408checking for i386-apple-darwin-nmedit... no
409checking for nmedit... nmedit
410checking for -single_module linker flag... yes
411checking for -exported_symbols_list linker flag... yes
412checking if gcc supports -fno-rtti -fno-exceptions... no
413checking for gcc option to produce PIC... -fno-common
414checking if gcc PIC flag -fno-common works... yes
415checking if gcc static flag -static works... no
416checking if gcc supports -c -o file.o... yes
417checking whether the gcc linker (/usr/libexec/gcc/i686-apple-darwin9/4.0.1/ld) supports shared libraries... yes
418checking dynamic linker characteristics... darwin dyld
419checking how to hardcode library paths into programs... immediate
420checking whether stripping libraries is possible... yes
421checking if libtool supports shared libraries... yes
422checking whether to build shared libraries... no
423checking whether to build static libraries... yes
424configure: creating libtool
425appending configuration tag "CXX" to libtool
426checking for ld used by g++... /usr/libexec/gcc/i686-apple-darwin9/4.0.1/ld
427checking if the linker (/usr/libexec/gcc/i686-apple-darwin9/4.0.1/ld) is GNU ld... no
428checking whether the g++ linker (/usr/libexec/gcc/i686-apple-darwin9/4.0.1/ld) supports shared libraries... yes
429checking for g++ option to produce PIC... -fno-common
430checking if g++ PIC flag -fno-common works... yes
431checking if g++ static flag -static works... no
432checking if g++ supports -c -o file.o... yes
433checking whether the g++ linker (/usr/libexec/gcc/i686-apple-darwin9/4.0.1/ld) supports shared libraries... yes
434checking dynamic linker characteristics... darwin dyld
435(cached) (cached) checking how to hardcode library paths into programs... immediate
436appending configuration tag "F77" to libtool
437checking whether to enable maintainer-specific portions of Makefiles... no
438checking sys/mman.h usability... yes
439checking sys/mman.h presence... yes
440checking for sys/mman.h... yes
441checking for mmap... yes
442checking for sys/mman.h... (cached) yes
443checking for mmap... (cached) yes
444checking whether read-only mmap of a plain file works... yes
445checking whether mmap from /dev/zero works... no
446checking for MAP_ANON(YMOUS)... yes
447checking whether mmap with MAP_ANON(YMOUS) works... yes
448checking for ANSI C header files... (cached) yes
449checking for memcpy... yes
450checking for working alloca.h... yes
451checking for alloca... yes
452checking size of double... 8
453checking size of long double... 16
454checking whether byte ordering is bigendian... no
455checking assembler .cfi pseudo-op support... no
456checking whether .eh_frame section should be read-only... no
457checking for __attribute__((visibility("hidden")))... no
458configure: creating ./config.status
459config.status: creating include/Makefile
460config.status: creating include/ffi.h
461config.status: creating Makefile
462config.status: creating testsuite/Makefile
463config.status: creating man/Makefile
464config.status: creating libffi.pc
465config.status: creating fficonfig.h
466config.status: linking src/x86/ffitarget.h to include/ffitarget.h
467config.status: executing depfiles commands
468config.status: executing include commands
469config.status: executing src commands
470touch stamp.ffi
471cp build/include/ffi.h .
472make -C build MAKEFLAGS=
473make "AR_FLAGS=" "CC_FOR_BUILD=" "CFLAGS=-g -O2" "CXXFLAGS=-g -O2" "CFLAGS_FOR_BUILD=" "CFLAGS_FOR_TARGET=" "INSTALL=/usr/bin/install -c" "INSTALL_DATA=/usr/bin/install -c -m 644" "INSTALL_PROGRAM=/usr/bin/install -c" "INSTALL_SCRIPT=/usr/bin/install -c" "JC1FLAGS=" "LDFLAGS=" "LIBCFLAGS=" "LIBCFLAGS_FOR_TARGET=" "MAKE=make" "MAKEINFO=/bin/sh /Users/mvanier/_/src/ghc/ghc-6.10.2/libffi/build/missing --run makeinfo " "PICFLAG=" "PICFLAG_FOR_TARGET=" "RUNTESTFLAGS=" "SHELL=/bin/sh" "exec_prefix=/usr/local" "infodir=/usr/local/share/info" "libdir=/usr/local/lib" "prefix=/usr/local" "AR=ar" "AS=as" "CC=gcc" "CXX=g++" "LD=ld" "NM=" "RANLIB=ranlib" "DESTDIR=" all-recursive
474Making all in include
475make[4]: Nothing to be done for `all'.
476Making all in testsuite
477make[4]: Nothing to be done for `all'.
478Making all in man
479make[4]: Nothing to be done for `all'.
480depbase=`echo src/debug.lo | sed 's|[^/]*$|.deps/&|;s|\.lo$||'`;\
481        /bin/sh ./libtool --tag=CC   --mode=compile gcc -DHAVE_CONFIG_H -I.  -I. -I./include -Iinclude -I./src  -Wall -g -fexceptions -g -O2 -MT src/debug.lo -MD -MP -MF $depbase.Tpo -c -o src/debug.lo src/debug.c &&\
482        mv -f $depbase.Tpo $depbase.Plo
483 gcc -DHAVE_CONFIG_H -I. -I. -I./include -Iinclude -I./src -Wall -g -fexceptions -g -O2 -MT src/debug.lo -MD -MP -MF src/.deps/debug.Tpo -c src/debug.c -o src/debug.o
484depbase=`echo src/prep_cif.lo | sed 's|[^/]*$|.deps/&|;s|\.lo$||'`;\
485        /bin/sh ./libtool --tag=CC   --mode=compile gcc -DHAVE_CONFIG_H -I.  -I. -I./include -Iinclude -I./src  -Wall -g -fexceptions -g -O2 -MT src/prep_cif.lo -MD -MP -MF $depbase.Tpo -c -o src/prep_cif.lo src/prep_cif.c &&\
486        mv -f $depbase.Tpo $depbase.Plo
487 gcc -DHAVE_CONFIG_H -I. -I. -I./include -Iinclude -I./src -Wall -g -fexceptions -g -O2 -MT src/prep_cif.lo -MD -MP -MF src/.deps/prep_cif.Tpo -c src/prep_cif.c -o src/prep_cif.o
488depbase=`echo src/types.lo | sed 's|[^/]*$|.deps/&|;s|\.lo$||'`;\
489        /bin/sh ./libtool --tag=CC   --mode=compile gcc -DHAVE_CONFIG_H -I.  -I. -I./include -Iinclude -I./src  -Wall -g -fexceptions -g -O2 -MT src/types.lo -MD -MP -MF $depbase.Tpo -c -o src/types.lo src/types.c &&\
490        mv -f $depbase.Tpo $depbase.Plo
491 gcc -DHAVE_CONFIG_H -I. -I. -I./include -Iinclude -I./src -Wall -g -fexceptions -g -O2 -MT src/types.lo -MD -MP -MF src/.deps/types.Tpo -c src/types.c -o src/types.o
492depbase=`echo src/raw_api.lo | sed 's|[^/]*$|.deps/&|;s|\.lo$||'`;\
493        /bin/sh ./libtool --tag=CC   --mode=compile gcc -DHAVE_CONFIG_H -I.  -I. -I./include -Iinclude -I./src  -Wall -g -fexceptions -g -O2 -MT src/raw_api.lo -MD -MP -MF $depbase.Tpo -c -o src/raw_api.lo src/raw_api.c &&\
494        mv -f $depbase.Tpo $depbase.Plo
495 gcc -DHAVE_CONFIG_H -I. -I. -I./include -Iinclude -I./src -Wall -g -fexceptions -g -O2 -MT src/raw_api.lo -MD -MP -MF src/.deps/raw_api.Tpo -c src/raw_api.c -o src/raw_api.o
496depbase=`echo src/java_raw_api.lo | sed 's|[^/]*$|.deps/&|;s|\.lo$||'`;\
497        /bin/sh ./libtool --tag=CC   --mode=compile gcc -DHAVE_CONFIG_H -I.  -I. -I./include -Iinclude -I./src  -Wall -g -fexceptions -g -O2 -MT src/java_raw_api.lo -MD -MP -MF $depbase.Tpo -c -o src/java_raw_api.lo src/java_raw_api.c &&\
498        mv -f $depbase.Tpo $depbase.Plo
499 gcc -DHAVE_CONFIG_H -I. -I. -I./include -Iinclude -I./src -Wall -g -fexceptions -g -O2 -MT src/java_raw_api.lo -MD -MP -MF src/.deps/java_raw_api.Tpo -c src/java_raw_api.c -o src/java_raw_api.o
500depbase=`echo src/closures.lo | sed 's|[^/]*$|.deps/&|;s|\.lo$||'`;\
501        /bin/sh ./libtool --tag=CC   --mode=compile gcc -DHAVE_CONFIG_H -I.  -I. -I./include -Iinclude -I./src  -Wall -g -fexceptions -g -O2 -MT src/closures.lo -MD -MP -MF $depbase.Tpo -c -o src/closures.lo src/closures.c &&\
502        mv -f $depbase.Tpo $depbase.Plo
503 gcc -DHAVE_CONFIG_H -I. -I. -I./include -Iinclude -I./src -Wall -g -fexceptions -g -O2 -MT src/closures.lo -MD -MP -MF src/.deps/closures.Tpo -c src/closures.c -o src/closures.o
504depbase=`echo src/x86/ffi.lo | sed 's|[^/]*$|.deps/&|;s|\.lo$||'`;\
505        /bin/sh ./libtool --tag=CC   --mode=compile gcc -DHAVE_CONFIG_H -I.  -I. -I./include -Iinclude -I./src  -Wall -g -fexceptions -g -O2 -MT src/x86/ffi.lo -MD -MP -MF $depbase.Tpo -c -o src/x86/ffi.lo src/x86/ffi.c &&\
506        mv -f $depbase.Tpo $depbase.Plo
507 gcc -DHAVE_CONFIG_H -I. -I. -I./include -Iinclude -I./src -Wall -g -fexceptions -g -O2 -MT src/x86/ffi.lo -MD -MP -MF src/x86/.deps/ffi.Tpo -c src/x86/ffi.c -o src/x86/ffi.o
508depbase=`echo src/x86/darwin.lo | sed 's|[^/]*$|.deps/&|;s|\.lo$||'`;\
509        /bin/sh ./libtool   --mode=compile gcc -DHAVE_CONFIG_H -I.  -I. -I./include -Iinclude -I./src  -I. -I./include -Iinclude -I./src -g -O2 -MT src/x86/darwin.lo -MD -MP -MF $depbase.Tpo -c -o src/x86/darwin.lo src/x86/darwin.S &&\
510        mv -f $depbase.Tpo $depbase.Plo
511 gcc -DHAVE_CONFIG_H -I. -I. -I./include -Iinclude -I./src -I. -I./include -Iinclude -I./src -g -O2 -MT src/x86/darwin.lo -MD -MP -MF src/x86/.deps/darwin.Tpo -c src/x86/darwin.S -o src/x86/darwin.o
512depbase=`echo src/x86/ffi64.lo | sed 's|[^/]*$|.deps/&|;s|\.lo$||'`;\
513        /bin/sh ./libtool --tag=CC   --mode=compile gcc -DHAVE_CONFIG_H -I.  -I. -I./include -Iinclude -I./src  -Wall -g -fexceptions -g -O2 -MT src/x86/ffi64.lo -MD -MP -MF $depbase.Tpo -c -o src/x86/ffi64.lo src/x86/ffi64.c &&\
514        mv -f $depbase.Tpo $depbase.Plo
515 gcc -DHAVE_CONFIG_H -I. -I. -I./include -Iinclude -I./src -Wall -g -fexceptions -g -O2 -MT src/x86/ffi64.lo -MD -MP -MF src/x86/.deps/ffi64.Tpo -c src/x86/ffi64.c -o src/x86/ffi64.o
516depbase=`echo src/x86/darwin64.lo | sed 's|[^/]*$|.deps/&|;s|\.lo$||'`;\
517        /bin/sh ./libtool   --mode=compile gcc -DHAVE_CONFIG_H -I.  -I. -I./include -Iinclude -I./src  -I. -I./include -Iinclude -I./src -g -O2 -MT src/x86/darwin64.lo -MD -MP -MF $depbase.Tpo -c -o src/x86/darwin64.lo src/x86/darwin64.S &&\
518        mv -f $depbase.Tpo $depbase.Plo
519 gcc -DHAVE_CONFIG_H -I. -I. -I./include -Iinclude -I./src -I. -I./include -Iinclude -I./src -g -O2 -MT src/x86/darwin64.lo -MD -MP -MF src/x86/.deps/darwin64.Tpo -c src/x86/darwin64.S -o src/x86/darwin64.o
520/bin/sh ./libtool --tag=CC   --mode=link gcc -Wall -g -fexceptions -g -O2 -version-info `grep -v '^#' ./libtool-version`  -o libffi.la -rpath /usr/local/lib src/debug.lo src/prep_cif.lo src/types.lo src/raw_api.lo src/java_raw_api.lo src/closures.lo     src/x86/ffi.lo src/x86/darwin.lo src/x86/ffi64.lo src/x86/darwin64.lo                   
521mkdir .libs
522ar cru .libs/libffi.a  src/debug.o src/prep_cif.o src/types.o src/raw_api.o src/java_raw_api.o src/closures.o src/x86/ffi.o src/x86/darwin.o src/x86/ffi64.o src/x86/darwin64.o
523ranlib .libs/libffi.a
524ranlib: file: .libs/libffi.a(ffi64.o) has no symbols
525creating libffi.la
526(cd .libs && rm -f libffi.la && cp -p ../libffi.la libffi.la)
527/bin/sh ./libtool --tag=CC   --mode=link gcc -Wall -g -fexceptions -g -O2   -o libffi_convenience.la  src/debug.lo src/prep_cif.lo src/types.lo src/raw_api.lo src/java_raw_api.lo src/closures.lo     src/x86/ffi.lo src/x86/darwin.lo src/x86/ffi64.lo src/x86/darwin64.lo                   
528ar cru .libs/libffi_convenience.a  src/debug.o src/prep_cif.o src/types.o src/raw_api.o src/java_raw_api.o src/closures.o src/x86/ffi.o src/x86/darwin.o src/x86/ffi64.o src/x86/darwin64.o
529ranlib .libs/libffi_convenience.a
530ranlib: file: .libs/libffi_convenience.a(ffi64.o) has no symbols
531creating libffi_convenience.la
532(cd .libs && rm -f libffi_convenience.la && cp -p ../libffi_convenience.la libffi_convenience.la)
533(cd build; ./libtool --mode=install cp libffi.la /Users/mvanier/_/src/ghc/ghc-6.10.2/libffi)
534cp .libs/libffi.lai /Users/mvanier/_/src/ghc/ghc-6.10.2/libffi/libffi.la
535cp .libs/libffi.a /Users/mvanier/_/src/ghc/ghc-6.10.2/libffi/libffi.a
536chmod 644 /Users/mvanier/_/src/ghc/ghc-6.10.2/libffi/libffi.a
537ranlib /Users/mvanier/_/src/ghc/ghc-6.10.2/libffi/libffi.a
538ranlib: file: /Users/mvanier/_/src/ghc/ghc-6.10.2/libffi/libffi.a(ffi64.o) has no symbols
539libtool: install: warning: remember to run `libtool --finish /usr/local/lib'
540make -C utils/mkdependC boot
541rm -f -f mkdependC
542echo '#!/opt/local/bin/perl'                               >> mkdependC
543echo '$DEFAULT_TMPDIR = "/tmp";' >> mkdependC
544echo '$CPP            = "gcc -E ";'            >> mkdependC
545echo '$BUILDPLATFORM  = "i386-apple-darwin";'  >> mkdependC
546cat mkdependC.prl                                >> mkdependC
547chmod +x mkdependC
548make -C utils with-bootstrapping-compiler
549make -C installPackage with-bootstrapping-compiler
550/Users/mvanier/_/src/ghc/ghc-6.10.2/libraries/cabal-bin /usr/bin/ghc /Users/mvanier/_/src/ghc/ghc-6.10.2/libraries/bootstrapping.conf 1.6.0.3 configure --distpref dist-inplace          \
551                           --prefix=`/Users/mvanier/_/src/ghc/ghc-6.10.2/utils/pwd/pwd forwardslash`/install-inplace  \
552                           --with-compiler=/usr/bin/ghc --with-hc-pkg=/usr/bin/ghc-pkg --package-db /Users/mvanier/_/src/ghc/ghc-6.10.2/libraries/bootstrapping.conf      \
553                           --libsubdir='$pkgid' --with-gcc=gcc --with-ld=/usr/bin/ld  --with-alex="/Users/mvanier/.cabal/bin/alex" --with-happy="/Users/mvanier/.cabal/bin/happy"    --configure-option='--prefix=/pkg/ghc' --configure-option=--with-cc="gcc"         \
554                           --constraint="Cabal == 1.6.0.3"
555Configuring installPackage-1.0...
556Warning: This package indirectly depends on multiple versions of the same
557package. This is highly likely to cause a compile failure.
558package process-1.0.1.0 requires filepath-1.1.0.1
559package directory-1.0.0.2 requires filepath-1.1.0.1
560package Cabal-1.6.0.3 requires filepath-1.1.0.2
561/Users/mvanier/_/src/ghc/ghc-6.10.2/libraries/cabal-bin /usr/bin/ghc /Users/mvanier/_/src/ghc/ghc-6.10.2/libraries/bootstrapping.conf 1.6.0.3 build     --distpref dist-inplace --ghc-option=-H32m --ghc-option=-O --ghc-option=-Wall
562Preprocessing executables for installPackage-1.0...
563Building installPackage-1.0...
564[1 of 1] Compiling Main             ( installPackage.hs, dist-inplace/build/installPackage/installPackage-tmp/Main.o )
565Linking dist-inplace/build/installPackage/installPackage ...
566ld: in /Users/mvanier/_/src/ghc/ghc-6.10.2/libraries/Cabal/dist-bootstrapping/build/libHSCabal-1.6.0.3.a, archive has no table of contents
567collect2: ld returned 1 exit status
568make[2]: *** [with-bootstrapping-compiler] Error 1
569make[1]: *** [with-bootstrapping-compiler.installPackage] Error 2
570make: *** [stage1] Error 2