Ticket #2751: build.log

File build.log, 62.6 KB (added by guest, 5 years ago)

The output of the make process (elided because of Trac's limitations).

Line 
1grep: packages: No such file or directory
2make -C libraries boot
3make[1]: Entering directory `/home/michael/Development/junk/ghc-6.10.1/libraries'
4rm -f -rf ifBuildable
5mkdir ifBuildable
6cp ifBuildable.hs ifBuildable/
7cd ifBuildable && /home/michael/software/bin/ghc -Wall --make ifBuildable -o ifBuildable
8[1 of 1] Compiling Main             ( ifBuildable.hs, ifBuildable.o )
9Linking ifBuildable ...
10mkdir bootstrapping
11/home/michael/software/bin/ghc -Wall -DCABAL_VERSION=1,6,0,1 -odir /home/michael/Development/junk/ghc-6.10.1/libraries/bootstrapping -hidir /home/michael/Development/junk/ghc-6.10.1/libraries/bootstrapping -i/home/michael/Development/junk/ghc-6.10.1/libraries/Cabal -i/home/michael/Development/junk/ghc-6.10.1/libraries/filepath -i/home/michael/Development/junk/ghc-6.10.1/libraries/hpc --make cabal-bin -o cabal-bin
12
13/home/michael/Development/junk/ghc-6.10.1/libraries/Cabal/Distribution/Simple/Utils.hs:1:11:
14    Warning: -fffi is deprecated: use -XForeignFunctionInterface or pragma {-# LANGUAGE ForeignFunctionInterface#-} instead
15
16/home/michael/Development/junk/ghc-6.10.1/libraries/Cabal/Distribution/Simple/Utils.hs:4:15:
17    Warning: -fffi is deprecated: use -XForeignFunctionInterface or pragma {-# LANGUAGE ForeignFunctionInterface#-} instead
18
19/home/michael/Development/junk/ghc-6.10.1/libraries/Cabal/Distribution/Simple/InstallDirs.hs:1:11:
20    Warning: -fffi is deprecated: use -XForeignFunctionInterface or pragma {-# LANGUAGE ForeignFunctionInterface#-} instead
21
22/home/michael/Development/junk/ghc-6.10.1/libraries/Cabal/Distribution/Simple/InstallDirs.hs:4:15:
23    Warning: -fffi is deprecated: use -XForeignFunctionInterface or pragma {-# LANGUAGE ForeignFunctionInterface#-} instead
24[ 1 of 54] Compiling System.FilePath.Windows ( /home/michael/Development/junk/ghc-6.10.1/libraries/filepath/System/FilePath/Windows.hs, /home/michael/Development/junk/ghc-6.10.1/libraries/bootstrapping/System/FilePath/Windows.o )
25[ 2 of 54] Compiling System.FilePath.Posix ( /home/michael/Development/junk/ghc-6.10.1/libraries/filepath/System/FilePath/Posix.hs, /home/michael/Development/junk/ghc-6.10.1/libraries/bootstrapping/System/FilePath/Posix.o )
26[ 3 of 54] Compiling System.FilePath  ( /home/michael/Development/junk/ghc-6.10.1/libraries/filepath/System/FilePath.hs, /home/michael/Development/junk/ghc-6.10.1/libraries/bootstrapping/System/FilePath.o )
27[ 4 of 54] Compiling Distribution.Simple.GHC.Makefile ( /home/michael/Development/junk/ghc-6.10.1/libraries/Cabal/Distribution/Simple/GHC/Makefile.hs, /home/michael/Development/junk/ghc-6.10.1/libraries/bootstrapping/Distribution/Simple/GHC/Makefile.o )
28[ 5 of 54] Compiling Distribution.Compat.Permissions ( /home/michael/Development/junk/ghc-6.10.1/libraries/Cabal/Distribution/Compat/Permissions.hs, /home/michael/Development/junk/ghc-6.10.1/libraries/bootstrapping/Distribution/Compat/Permissions.o )
29[ 6 of 54] Compiling Distribution.Compat.Exception ( /home/michael/Development/junk/ghc-6.10.1/libraries/Cabal/Distribution/Compat/Exception.hs, /home/michael/Development/junk/ghc-6.10.1/libraries/bootstrapping/Distribution/Compat/Exception.o )
30[ 7 of 54] Compiling Distribution.Compat.TempFile ( /home/michael/Development/junk/ghc-6.10.1/libraries/Cabal/Distribution/Compat/TempFile.hs, /home/michael/Development/junk/ghc-6.10.1/libraries/bootstrapping/Distribution/Compat/TempFile.o )
31[ 8 of 54] Compiling Distribution.GetOpt ( /home/michael/Development/junk/ghc-6.10.1/libraries/Cabal/Distribution/GetOpt.hs, /home/michael/Development/junk/ghc-6.10.1/libraries/bootstrapping/Distribution/GetOpt.o )
32[ 9 of 54] Compiling Distribution.Compat.ReadP ( /home/michael/Development/junk/ghc-6.10.1/libraries/Cabal/Distribution/Compat/ReadP.hs, /home/michael/Development/junk/ghc-6.10.1/libraries/bootstrapping/Distribution/Compat/ReadP.o )
33[10 of 54] Compiling Distribution.Text ( /home/michael/Development/junk/ghc-6.10.1/libraries/Cabal/Distribution/Text.hs, /home/michael/Development/junk/ghc-6.10.1/libraries/bootstrapping/Distribution/Text.o )
34[11 of 54] Compiling Distribution.Version ( /home/michael/Development/junk/ghc-6.10.1/libraries/Cabal/Distribution/Version.hs, /home/michael/Development/junk/ghc-6.10.1/libraries/bootstrapping/Distribution/Version.o )
35[12 of 54] Compiling Language.Haskell.Extension ( /home/michael/Development/junk/ghc-6.10.1/libraries/Cabal/Language/Haskell/Extension.hs, /home/michael/Development/junk/ghc-6.10.1/libraries/bootstrapping/Language/Haskell/Extension.o )
36[13 of 54] Compiling Distribution.System ( /home/michael/Development/junk/ghc-6.10.1/libraries/Cabal/Distribution/System.hs, /home/michael/Development/junk/ghc-6.10.1/libraries/bootstrapping/Distribution/System.o )
37[14 of 54] Compiling Distribution.Simple.PreProcess.Unlit ( /home/michael/Development/junk/ghc-6.10.1/libraries/Cabal/Distribution/Simple/PreProcess/Unlit.hs, /home/michael/Development/junk/ghc-6.10.1/libraries/bootstrapping/Distribution/Simple/PreProcess/Unlit.o )
38[15 of 54] Compiling Distribution.ReadE ( /home/michael/Development/junk/ghc-6.10.1/libraries/Cabal/Distribution/ReadE.hs, /home/michael/Development/junk/ghc-6.10.1/libraries/bootstrapping/Distribution/ReadE.o )
39[16 of 54] Compiling Distribution.Verbosity ( /home/michael/Development/junk/ghc-6.10.1/libraries/Cabal/Distribution/Verbosity.hs, /home/michael/Development/junk/ghc-6.10.1/libraries/bootstrapping/Distribution/Verbosity.o )
40[17 of 54] Compiling Distribution.Package ( /home/michael/Development/junk/ghc-6.10.1/libraries/Cabal/Distribution/Package.hs, /home/michael/Development/junk/ghc-6.10.1/libraries/bootstrapping/Distribution/Package.o )
41[18 of 54] Compiling Distribution.ModuleName ( /home/michael/Development/junk/ghc-6.10.1/libraries/Cabal/Distribution/ModuleName.hs, /home/michael/Development/junk/ghc-6.10.1/libraries/bootstrapping/Distribution/ModuleName.o )
42[19 of 54] Compiling Distribution.Simple.Utils ( /home/michael/Development/junk/ghc-6.10.1/libraries/Cabal/Distribution/Simple/Utils.hs, /home/michael/Development/junk/ghc-6.10.1/libraries/bootstrapping/Distribution/Simple/Utils.o )
43[20 of 54] Compiling Distribution.Simple.PackageIndex ( /home/michael/Development/junk/ghc-6.10.1/libraries/Cabal/Distribution/Simple/PackageIndex.hs, /home/michael/Development/junk/ghc-6.10.1/libraries/bootstrapping/Distribution/Simple/PackageIndex.o )
44[21 of 54] Compiling Distribution.Simple.Program ( /home/michael/Development/junk/ghc-6.10.1/libraries/Cabal/Distribution/Simple/Program.hs, /home/michael/Development/junk/ghc-6.10.1/libraries/bootstrapping/Distribution/Simple/Program.o )
45[22 of 54] Compiling Distribution.License ( /home/michael/Development/junk/ghc-6.10.1/libraries/Cabal/Distribution/License.hs, /home/michael/Development/junk/ghc-6.10.1/libraries/bootstrapping/Distribution/License.o )
46[23 of 54] Compiling Distribution.Compiler ( /home/michael/Development/junk/ghc-6.10.1/libraries/Cabal/Distribution/Compiler.hs, /home/michael/Development/junk/ghc-6.10.1/libraries/bootstrapping/Distribution/Compiler.o )
47[24 of 54] Compiling Distribution.PackageDescription ( /home/michael/Development/junk/ghc-6.10.1/libraries/Cabal/Distribution/PackageDescription.hs, /home/michael/Development/junk/ghc-6.10.1/libraries/bootstrapping/Distribution/PackageDescription.o )
48[25 of 54] Compiling Distribution.PackageDescription.Configuration ( /home/michael/Development/junk/ghc-6.10.1/libraries/Cabal/Distribution/PackageDescription/Configuration.hs, /home/michael/Development/junk/ghc-6.10.1/libraries/bootstrapping/Distribution/PackageDescription/Configuration.o )
49[26 of 54] Compiling Distribution.PackageDescription.Check ( /home/michael/Development/junk/ghc-6.10.1/libraries/Cabal/Distribution/PackageDescription/Check.hs, /home/michael/Development/junk/ghc-6.10.1/libraries/bootstrapping/Distribution/PackageDescription/Check.o )
50[27 of 54] Compiling Distribution.ParseUtils ( /home/michael/Development/junk/ghc-6.10.1/libraries/Cabal/Distribution/ParseUtils.hs, /home/michael/Development/junk/ghc-6.10.1/libraries/bootstrapping/Distribution/ParseUtils.o )
51[28 of 54] Compiling Distribution.InstalledPackageInfo ( /home/michael/Development/junk/ghc-6.10.1/libraries/Cabal/Distribution/InstalledPackageInfo.hs, /home/michael/Development/junk/ghc-6.10.1/libraries/bootstrapping/Distribution/InstalledPackageInfo.o )
52[29 of 54] Compiling Distribution.Simple.GHC.IPI642 ( /home/michael/Development/junk/ghc-6.10.1/libraries/Cabal/Distribution/Simple/GHC/IPI642.hs, /home/michael/Development/junk/ghc-6.10.1/libraries/bootstrapping/Distribution/Simple/GHC/IPI642.o )
53[30 of 54] Compiling Distribution.Simple.GHC.IPI641 ( /home/michael/Development/junk/ghc-6.10.1/libraries/Cabal/Distribution/Simple/GHC/IPI641.hs, /home/michael/Development/junk/ghc-6.10.1/libraries/bootstrapping/Distribution/Simple/GHC/IPI641.o )
54[31 of 54] Compiling Distribution.PackageDescription.Parse ( /home/michael/Development/junk/ghc-6.10.1/libraries/Cabal/Distribution/PackageDescription/Parse.hs, /home/michael/Development/junk/ghc-6.10.1/libraries/bootstrapping/Distribution/PackageDescription/Parse.o )
55[32 of 54] Compiling Distribution.Simple.Command ( /home/michael/Development/junk/ghc-6.10.1/libraries/Cabal/Distribution/Simple/Command.hs, /home/michael/Development/junk/ghc-6.10.1/libraries/bootstrapping/Distribution/Simple/Command.o )
56[33 of 54] Compiling Distribution.Simple.Compiler ( /home/michael/Development/junk/ghc-6.10.1/libraries/Cabal/Distribution/Simple/Compiler.hs, /home/michael/Development/junk/ghc-6.10.1/libraries/bootstrapping/Distribution/Simple/Compiler.o )
57[34 of 54] Compiling Distribution.Simple.InstallDirs ( /home/michael/Development/junk/ghc-6.10.1/libraries/Cabal/Distribution/Simple/InstallDirs.hs, /home/michael/Development/junk/ghc-6.10.1/libraries/bootstrapping/Distribution/Simple/InstallDirs.o )
58[35 of 54] Compiling Distribution.Simple.Setup ( /home/michael/Development/junk/ghc-6.10.1/libraries/Cabal/Distribution/Simple/Setup.hs, /home/michael/Development/junk/ghc-6.10.1/libraries/bootstrapping/Distribution/Simple/Setup.o )
59[36 of 54] Compiling Distribution.Make ( /home/michael/Development/junk/ghc-6.10.1/libraries/Cabal/Distribution/Make.hs, /home/michael/Development/junk/ghc-6.10.1/libraries/bootstrapping/Distribution/Make.o )
60[37 of 54] Compiling Distribution.Simple.LocalBuildInfo ( /home/michael/Development/junk/ghc-6.10.1/libraries/Cabal/Distribution/Simple/LocalBuildInfo.hs, /home/michael/Development/junk/ghc-6.10.1/libraries/bootstrapping/Distribution/Simple/LocalBuildInfo.o )
61[38 of 54] Compiling Distribution.Simple.Build.Macros ( /home/michael/Development/junk/ghc-6.10.1/libraries/Cabal/Distribution/Simple/Build/Macros.hs, /home/michael/Development/junk/ghc-6.10.1/libraries/bootstrapping/Distribution/Simple/Build/Macros.o )
62[39 of 54] Compiling Distribution.Simple.BuildPaths ( /home/michael/Development/junk/ghc-6.10.1/libraries/Cabal/Distribution/Simple/BuildPaths.hs, /home/michael/Development/junk/ghc-6.10.1/libraries/bootstrapping/Distribution/Simple/BuildPaths.o )
63[40 of 54] Compiling Distribution.Simple.Build.PathsModule ( /home/michael/Development/junk/ghc-6.10.1/libraries/Cabal/Distribution/Simple/Build/PathsModule.hs, /home/michael/Development/junk/ghc-6.10.1/libraries/bootstrapping/Distribution/Simple/Build/PathsModule.o )
64[41 of 54] Compiling Distribution.Simple.GHC ( /home/michael/Development/junk/ghc-6.10.1/libraries/Cabal/Distribution/Simple/GHC.hs, /home/michael/Development/junk/ghc-6.10.1/libraries/bootstrapping/Distribution/Simple/GHC.o )
65[42 of 54] Compiling Distribution.Simple.JHC ( /home/michael/Development/junk/ghc-6.10.1/libraries/Cabal/Distribution/Simple/JHC.hs, /home/michael/Development/junk/ghc-6.10.1/libraries/bootstrapping/Distribution/Simple/JHC.o )
66[43 of 54] Compiling Distribution.Simple.NHC ( /home/michael/Development/junk/ghc-6.10.1/libraries/Cabal/Distribution/Simple/NHC.hs, /home/michael/Development/junk/ghc-6.10.1/libraries/bootstrapping/Distribution/Simple/NHC.o )
67[44 of 54] Compiling Distribution.Simple.PreProcess ( /home/michael/Development/junk/ghc-6.10.1/libraries/Cabal/Distribution/Simple/PreProcess.hs, /home/michael/Development/junk/ghc-6.10.1/libraries/bootstrapping/Distribution/Simple/PreProcess.o )
68[45 of 54] Compiling Distribution.Simple.Hugs ( /home/michael/Development/junk/ghc-6.10.1/libraries/Cabal/Distribution/Simple/Hugs.hs, /home/michael/Development/junk/ghc-6.10.1/libraries/bootstrapping/Distribution/Simple/Hugs.o )
69[46 of 54] Compiling Distribution.Simple.Build ( /home/michael/Development/junk/ghc-6.10.1/libraries/Cabal/Distribution/Simple/Build.hs, /home/michael/Development/junk/ghc-6.10.1/libraries/bootstrapping/Distribution/Simple/Build.o )
70[47 of 54] Compiling Distribution.Simple.Haddock ( /home/michael/Development/junk/ghc-6.10.1/libraries/Cabal/Distribution/Simple/Haddock.hs, /home/michael/Development/junk/ghc-6.10.1/libraries/bootstrapping/Distribution/Simple/Haddock.o )
71[48 of 54] Compiling Distribution.Simple.Install ( /home/michael/Development/junk/ghc-6.10.1/libraries/Cabal/Distribution/Simple/Install.hs, /home/michael/Development/junk/ghc-6.10.1/libraries/bootstrapping/Distribution/Simple/Install.o )
72[49 of 54] Compiling Distribution.Simple.Register ( /home/michael/Development/junk/ghc-6.10.1/libraries/Cabal/Distribution/Simple/Register.hs, /home/michael/Development/junk/ghc-6.10.1/libraries/bootstrapping/Distribution/Simple/Register.o )
73[50 of 54] Compiling Distribution.Simple.Configure ( /home/michael/Development/junk/ghc-6.10.1/libraries/Cabal/Distribution/Simple/Configure.hs, /home/michael/Development/junk/ghc-6.10.1/libraries/bootstrapping/Distribution/Simple/Configure.o )
74[51 of 54] Compiling Distribution.Simple.SrcDist ( /home/michael/Development/junk/ghc-6.10.1/libraries/Cabal/Distribution/Simple/SrcDist.hs, /home/michael/Development/junk/ghc-6.10.1/libraries/bootstrapping/Distribution/Simple/SrcDist.o )
75[52 of 54] Compiling Distribution.Simple.UserHooks ( /home/michael/Development/junk/ghc-6.10.1/libraries/Cabal/Distribution/Simple/UserHooks.hs, /home/michael/Development/junk/ghc-6.10.1/libraries/bootstrapping/Distribution/Simple/UserHooks.o )
76[53 of 54] Compiling Distribution.Simple ( /home/michael/Development/junk/ghc-6.10.1/libraries/Cabal/Distribution/Simple.hs, /home/michael/Development/junk/ghc-6.10.1/libraries/bootstrapping/Distribution/Simple.o )
77[54 of 54] Compiling Main             ( cabal-bin.hs, /home/michael/Development/junk/ghc-6.10.1/libraries/bootstrapping/Main.o )
78Linking cabal-bin ...
79echo "[]" > bootstrapping.conf.tmp
80cd extensible-exceptions && /home/michael/Development/junk/ghc-6.10.1/libraries/cabal-bin /home/michael/software/bin/ghc /home/michael/Development/junk/ghc-6.10.1/libraries/bootstrapping.conf clean     --distpref=dist-bootstrapping
81cleaning...
82cd extensible-exceptions && /home/michael/Development/junk/ghc-6.10.1/libraries/cabal-bin /home/michael/software/bin/ghc /home/michael/Development/junk/ghc-6.10.1/libraries/bootstrapping.conf configure --distpref=dist-bootstrapping --with-compiler=/home/michael/software/bin/ghc --with-hc-pkg=/home/michael/software/bin/ghc-pkg --package-db=/home/michael/Development/junk/ghc-6.10.1/libraries/bootstrapping.conf.tmp
83Configuring extensible-exceptions-0.1.0.0...
84cd extensible-exceptions && /home/michael/Development/junk/ghc-6.10.1/libraries/cabal-bin /home/michael/software/bin/ghc /home/michael/Development/junk/ghc-6.10.1/libraries/bootstrapping.conf build     --distpref=dist-bootstrapping
85Preprocessing library extensible-exceptions-0.1.0.0...
86Building extensible-exceptions-0.1.0.0...
87[1 of 1] Compiling Control.Exception.Extensible ( Control/Exception/Extensible.hs, dist-bootstrapping/build/Control/Exception/Extensible.o )
88/usr/bin/ar: creating dist-bootstrapping/build/libHSextensible-exceptions-0.1.0.0.a
89cd extensible-exceptions && /home/michael/Development/junk/ghc-6.10.1/libraries/cabal-bin /home/michael/software/bin/ghc /home/michael/Development/junk/ghc-6.10.1/libraries/bootstrapping.conf install   --distpref=dist-bootstrapping --inplace
90Installing library in
91/home/michael/Development/junk/ghc-6.10.1/libraries/extensible-exceptions/dist-bootstrapping/install/usr/local/lib/extensible-exceptions-0.1.0.0/ghc-6.10.1
92Registering extensible-exceptions-0.1.0.0...
93Reading package info from "dist-bootstrapping/inplace-pkg-config" ... done.
94Writing new package config file... done.
95cd filepath && /home/michael/Development/junk/ghc-6.10.1/libraries/cabal-bin /home/michael/software/bin/ghc /home/michael/Development/junk/ghc-6.10.1/libraries/bootstrapping.conf clean     --distpref=dist-bootstrapping
96cleaning...
97cd filepath && /home/michael/Development/junk/ghc-6.10.1/libraries/cabal-bin /home/michael/software/bin/ghc /home/michael/Development/junk/ghc-6.10.1/libraries/bootstrapping.conf configure --distpref=dist-bootstrapping --with-compiler=/home/michael/software/bin/ghc --with-hc-pkg=/home/michael/software/bin/ghc-pkg --package-db=/home/michael/Development/junk/ghc-6.10.1/libraries/bootstrapping.conf.tmp
98Configuring filepath-1.1.0.1...
99cd filepath && /home/michael/Development/junk/ghc-6.10.1/libraries/cabal-bin /home/michael/software/bin/ghc /home/michael/Development/junk/ghc-6.10.1/libraries/bootstrapping.conf build     --distpref=dist-bootstrapping
100Preprocessing library filepath-1.1.0.1...
101Building filepath-1.1.0.1...
102[1 of 3] Compiling System.FilePath.Windows ( System/FilePath/Windows.hs, dist-bootstrapping/build/System/FilePath/Windows.o )
103[2 of 3] Compiling System.FilePath.Posix ( System/FilePath/Posix.hs, dist-bootstrapping/build/System/FilePath/Posix.o )
104[3 of 3] Compiling System.FilePath  ( System/FilePath.hs, dist-bootstrapping/build/System/FilePath.o )
105/usr/bin/ar: creating dist-bootstrapping/build/libHSfilepath-1.1.0.1.a
106cd filepath && /home/michael/Development/junk/ghc-6.10.1/libraries/cabal-bin /home/michael/software/bin/ghc /home/michael/Development/junk/ghc-6.10.1/libraries/bootstrapping.conf install   --distpref=dist-bootstrapping --inplace
107Installing library in
108/home/michael/Development/junk/ghc-6.10.1/libraries/filepath/dist-bootstrapping/install/usr/local/lib/filepath-1.1.0.1/ghc-6.10.1
109Registering filepath-1.1.0.1...
110Reading package info from "dist-bootstrapping/inplace-pkg-config" ... done.
111Writing new package config file... done.
112cd Cabal    && /home/michael/Development/junk/ghc-6.10.1/libraries/cabal-bin /home/michael/software/bin/ghc /home/michael/Development/junk/ghc-6.10.1/libraries/bootstrapping.conf clean     --distpref=dist-bootstrapping
113cleaning...
114cd Cabal    && /home/michael/Development/junk/ghc-6.10.1/libraries/cabal-bin /home/michael/software/bin/ghc /home/michael/Development/junk/ghc-6.10.1/libraries/bootstrapping.conf configure --distpref=dist-bootstrapping --with-compiler=/home/michael/software/bin/ghc --with-hc-pkg=/home/michael/software/bin/ghc-pkg --package-db=/home/michael/Development/junk/ghc-6.10.1/libraries/bootstrapping.conf.tmp
115Configuring Cabal-1.6.0.1...
116cd Cabal    && /home/michael/Development/junk/ghc-6.10.1/libraries/cabal-bin /home/michael/software/bin/ghc /home/michael/Development/junk/ghc-6.10.1/libraries/bootstrapping.conf build     --distpref=dist-bootstrapping
117Preprocessing library Cabal-1.6.0.1...
118Building Cabal-1.6.0.1...
119
120Distribution/Simple/InstallDirs.hs:1:11:
121    Warning: -fffi is deprecated: use -XForeignFunctionInterface or pragma {-# LANGUAGE ForeignFunctionInterface#-} instead
122
123Distribution/Simple/InstallDirs.hs:4:15:
124    Warning: -fffi is deprecated: use -XForeignFunctionInterface or pragma {-# LANGUAGE ForeignFunctionInterface#-} instead
125
126Distribution/Simple/Utils.hs:1:11:
127    Warning: -fffi is deprecated: use -XForeignFunctionInterface or pragma {-# LANGUAGE ForeignFunctionInterface#-} instead
128
129Distribution/Simple/Utils.hs:4:15:
130    Warning: -fffi is deprecated: use -XForeignFunctionInterface or pragma {-# LANGUAGE ForeignFunctionInterface#-} instead
131[ 1 of 50] Compiling Distribution.Simple.GHC.Makefile ( Distribution/Simple/GHC/Makefile.hs, dist-bootstrapping/build/Distribution/Simple/GHC/Makefile.o )
132[ 2 of 50] Compiling Distribution.Compat.Permissions ( Distribution/Compat/Permissions.hs, dist-bootstrapping/build/Distribution/Compat/Permissions.o )
133[ 3 of 50] Compiling Distribution.Compat.Exception ( Distribution/Compat/Exception.hs, dist-bootstrapping/build/Distribution/Compat/Exception.o )
134[ 4 of 50] Compiling Distribution.Compat.TempFile ( Distribution/Compat/TempFile.hs, dist-bootstrapping/build/Distribution/Compat/TempFile.o )
135[ 5 of 50] Compiling Distribution.GetOpt ( Distribution/GetOpt.hs, dist-bootstrapping/build/Distribution/GetOpt.o )
136[ 6 of 50] Compiling Distribution.Compat.ReadP ( Distribution/Compat/ReadP.hs, dist-bootstrapping/build/Distribution/Compat/ReadP.o )
137[ 7 of 50] Compiling Distribution.Text ( Distribution/Text.hs, dist-bootstrapping/build/Distribution/Text.o )
138[ 8 of 50] Compiling Distribution.Version ( Distribution/Version.hs, dist-bootstrapping/build/Distribution/Version.o )
139[ 9 of 50] Compiling Language.Haskell.Extension ( Language/Haskell/Extension.hs, dist-bootstrapping/build/Language/Haskell/Extension.o )
140[10 of 50] Compiling Distribution.System ( Distribution/System.hs, dist-bootstrapping/build/Distribution/System.o )
141[11 of 50] Compiling Distribution.Simple.PreProcess.Unlit ( Distribution/Simple/PreProcess/Unlit.hs, dist-bootstrapping/build/Distribution/Simple/PreProcess/Unlit.o )
142[12 of 50] Compiling Distribution.ReadE ( Distribution/ReadE.hs, dist-bootstrapping/build/Distribution/ReadE.o )
143[13 of 50] Compiling Distribution.Verbosity ( Distribution/Verbosity.hs, dist-bootstrapping/build/Distribution/Verbosity.o )
144[14 of 50] Compiling Distribution.Package ( Distribution/Package.hs, dist-bootstrapping/build/Distribution/Package.o )
145[15 of 50] Compiling Distribution.ModuleName ( Distribution/ModuleName.hs, dist-bootstrapping/build/Distribution/ModuleName.o )
146[16 of 50] Compiling Distribution.Simple.Utils ( Distribution/Simple/Utils.hs, dist-bootstrapping/build/Distribution/Simple/Utils.o )
147[17 of 50] Compiling Distribution.Simple.PackageIndex ( Distribution/Simple/PackageIndex.hs, dist-bootstrapping/build/Distribution/Simple/PackageIndex.o )
148[18 of 50] Compiling Distribution.Simple.Program ( Distribution/Simple/Program.hs, dist-bootstrapping/build/Distribution/Simple/Program.o )
149[19 of 50] Compiling Distribution.License ( Distribution/License.hs, dist-bootstrapping/build/Distribution/License.o )
150[20 of 50] Compiling Distribution.Compiler ( Distribution/Compiler.hs, dist-bootstrapping/build/Distribution/Compiler.o )
151[21 of 50] Compiling Distribution.PackageDescription ( Distribution/PackageDescription.hs, dist-bootstrapping/build/Distribution/PackageDescription.o )
152[22 of 50] Compiling Distribution.PackageDescription.Configuration ( Distribution/PackageDescription/Configuration.hs, dist-bootstrapping/build/Distribution/PackageDescription/Configuration.o )
153[23 of 50] Compiling Distribution.PackageDescription.Check ( Distribution/PackageDescription/Check.hs, dist-bootstrapping/build/Distribution/PackageDescription/Check.o )
154[24 of 50] Compiling Distribution.ParseUtils ( Distribution/ParseUtils.hs, dist-bootstrapping/build/Distribution/ParseUtils.o )
155[25 of 50] Compiling Distribution.InstalledPackageInfo ( Distribution/InstalledPackageInfo.hs, dist-bootstrapping/build/Distribution/InstalledPackageInfo.o )
156[26 of 50] Compiling Distribution.Simple.GHC.IPI642 ( Distribution/Simple/GHC/IPI642.hs, dist-bootstrapping/build/Distribution/Simple/GHC/IPI642.o )
157[27 of 50] Compiling Distribution.Simple.GHC.IPI641 ( Distribution/Simple/GHC/IPI641.hs, dist-bootstrapping/build/Distribution/Simple/GHC/IPI641.o )
158[28 of 50] Compiling Distribution.PackageDescription.Parse ( Distribution/PackageDescription/Parse.hs, dist-bootstrapping/build/Distribution/PackageDescription/Parse.o )
159[29 of 50] Compiling Distribution.Simple.Command ( Distribution/Simple/Command.hs, dist-bootstrapping/build/Distribution/Simple/Command.o )
160[30 of 50] Compiling Distribution.Simple.Compiler ( Distribution/Simple/Compiler.hs, dist-bootstrapping/build/Distribution/Simple/Compiler.o )
161[31 of 50] Compiling Distribution.Simple.InstallDirs ( Distribution/Simple/InstallDirs.hs, dist-bootstrapping/build/Distribution/Simple/InstallDirs.o )
162[32 of 50] Compiling Distribution.Simple.Setup ( Distribution/Simple/Setup.hs, dist-bootstrapping/build/Distribution/Simple/Setup.o )
163[33 of 50] Compiling Distribution.Make ( Distribution/Make.hs, dist-bootstrapping/build/Distribution/Make.o )
164[34 of 50] Compiling Distribution.Simple.LocalBuildInfo ( Distribution/Simple/LocalBuildInfo.hs, dist-bootstrapping/build/Distribution/Simple/LocalBuildInfo.o )
165[35 of 50] Compiling Distribution.Simple.Build.Macros ( Distribution/Simple/Build/Macros.hs, dist-bootstrapping/build/Distribution/Simple/Build/Macros.o )
166[36 of 50] Compiling Distribution.Simple.BuildPaths ( Distribution/Simple/BuildPaths.hs, dist-bootstrapping/build/Distribution/Simple/BuildPaths.o )
167[37 of 50] Compiling Distribution.Simple.Build.PathsModule ( Distribution/Simple/Build/PathsModule.hs, dist-bootstrapping/build/Distribution/Simple/Build/PathsModule.o )
168[38 of 50] Compiling Distribution.Simple.GHC ( Distribution/Simple/GHC.hs, dist-bootstrapping/build/Distribution/Simple/GHC.o )
169[39 of 50] Compiling Distribution.Simple.JHC ( Distribution/Simple/JHC.hs, dist-bootstrapping/build/Distribution/Simple/JHC.o )
170[40 of 50] Compiling Distribution.Simple.NHC ( Distribution/Simple/NHC.hs, dist-bootstrapping/build/Distribution/Simple/NHC.o )
171[41 of 50] Compiling Distribution.Simple.PreProcess ( Distribution/Simple/PreProcess.hs, dist-bootstrapping/build/Distribution/Simple/PreProcess.o )
172[42 of 50] Compiling Distribution.Simple.Hugs ( Distribution/Simple/Hugs.hs, dist-bootstrapping/build/Distribution/Simple/Hugs.o )
173[43 of 50] Compiling Distribution.Simple.Build ( Distribution/Simple/Build.hs, dist-bootstrapping/build/Distribution/Simple/Build.o )
174[44 of 50] Compiling Distribution.Simple.Haddock ( Distribution/Simple/Haddock.hs, dist-bootstrapping/build/Distribution/Simple/Haddock.o )
175[45 of 50] Compiling Distribution.Simple.Install ( Distribution/Simple/Install.hs, dist-bootstrapping/build/Distribution/Simple/Install.o )
176[46 of 50] Compiling Distribution.Simple.Register ( Distribution/Simple/Register.hs, dist-bootstrapping/build/Distribution/Simple/Register.o )
177[47 of 50] Compiling Distribution.Simple.Configure ( Distribution/Simple/Configure.hs, dist-bootstrapping/build/Distribution/Simple/Configure.o )
178[48 of 50] Compiling Distribution.Simple.SrcDist ( Distribution/Simple/SrcDist.hs, dist-bootstrapping/build/Distribution/Simple/SrcDist.o )
179[49 of 50] Compiling Distribution.Simple.UserHooks ( Distribution/Simple/UserHooks.hs, dist-bootstrapping/build/Distribution/Simple/UserHooks.o )
180[50 of 50] Compiling Distribution.Simple ( Distribution/Simple.hs, dist-bootstrapping/build/Distribution/Simple.o )
181/usr/bin/ar: creating dist-bootstrapping/build/libHSCabal-1.6.0.1.a
182cd Cabal    && /home/michael/Development/junk/ghc-6.10.1/libraries/cabal-bin /home/michael/software/bin/ghc /home/michael/Development/junk/ghc-6.10.1/libraries/bootstrapping.conf install   --distpref=dist-bootstrapping --inplace
183Installing library in
184/home/michael/Development/junk/ghc-6.10.1/libraries/Cabal/dist-bootstrapping/install/usr/local/lib/Cabal-1.6.0.1/ghc-6.10.1
185Registering Cabal-1.6.0.1...
186Reading package info from "dist-bootstrapping/inplace-pkg-config" ... done.
187Writing new package config file... done.
188cd hpc    && /home/michael/Development/junk/ghc-6.10.1/libraries/cabal-bin /home/michael/software/bin/ghc /home/michael/Development/junk/ghc-6.10.1/libraries/bootstrapping.conf clean     --distpref=dist-bootstrapping
189cleaning...
190cd hpc    && /home/michael/Development/junk/ghc-6.10.1/libraries/cabal-bin /home/michael/software/bin/ghc /home/michael/Development/junk/ghc-6.10.1/libraries/bootstrapping.conf configure --distpref=dist-bootstrapping --with-compiler=/home/michael/software/bin/ghc --with-hc-pkg=/home/michael/software/bin/ghc-pkg --package-db=/home/michael/Development/junk/ghc-6.10.1/libraries/bootstrapping.conf.tmp
191Configuring hpc-0.5.0.2...
192cd hpc    && /home/michael/Development/junk/ghc-6.10.1/libraries/cabal-bin /home/michael/software/bin/ghc /home/michael/Development/junk/ghc-6.10.1/libraries/bootstrapping.conf build     --distpref=dist-bootstrapping
193Preprocessing library hpc-0.5.0.2...
194Building hpc-0.5.0.2...
195[1 of 4] Compiling Trace.Hpc.Util   ( Trace/Hpc/Util.hs, dist-bootstrapping/build/Trace/Hpc/Util.o )
196[2 of 4] Compiling Trace.Hpc.Tix    ( Trace/Hpc/Tix.hs, dist-bootstrapping/build/Trace/Hpc/Tix.o )
197[3 of 4] Compiling Trace.Hpc.Mix    ( Trace/Hpc/Mix.hs, dist-bootstrapping/build/Trace/Hpc/Mix.o )
198[4 of 4] Compiling Trace.Hpc.Reflect ( dist-bootstrapping/build/Trace/Hpc/Reflect.hs, dist-bootstrapping/build/Trace/Hpc/Reflect.o )
199/usr/bin/ar: creating dist-bootstrapping/build/libHShpc-0.5.0.2.a
200cd hpc    && /home/michael/Development/junk/ghc-6.10.1/libraries/cabal-bin /home/michael/software/bin/ghc /home/michael/Development/junk/ghc-6.10.1/libraries/bootstrapping.conf install   --distpref=dist-bootstrapping --inplace
201Installing library in
202/home/michael/Development/junk/ghc-6.10.1/libraries/hpc/dist-bootstrapping/install/usr/local/lib/hpc-0.5.0.2/ghc-6.10.1
203Registering hpc-0.5.0.2...
204Reading package info from "dist-bootstrapping/inplace-pkg-config" ... done.
205Writing new package config file... done.
206mv bootstrapping.conf.tmp bootstrapping.conf
207make[1]: Leaving directory `/home/michael/Development/junk/ghc-6.10.1/libraries'
208make -C gmp       all
209make[1]: Entering directory `/home/michael/Development/junk/ghc-6.10.1/gmp'
210make[1]: Nothing to be done for `all'.
211make[1]: Leaving directory `/home/michael/Development/junk/ghc-6.10.1/gmp'
212make -C libffi    all
213make[1]: Entering directory `/home/michael/Development/junk/ghc-6.10.1/libffi'
214rm -f -rf libffi-3.0.4 build
215/bin/tar -zxf libffi-3.0.4.tar.gz
216mv libffi-3.0.4 build
217chmod +x ln
218(set -o igncr 2>/dev/null) && set -o igncr; export SHELLOPTS; \
219            PATH=`pwd`:$PATH; \
220            export PATH; \
221            cd build && \
222            CC=gcc /bin/sh configure \
223                  --enable-static=yes \
224                  --enable-shared=yes \
225                  --host=i386-unknown-linux --build=i386-unknown-linux
226checking build system type... i386-unknown-linux-gnu
227checking host system type... i386-unknown-linux-gnu
228checking target system type... i386-unknown-linux-gnu
229checking for a BSD-compatible install... /usr/bin/install -c
230checking whether build environment is sane... yes
231checking for a thread-safe mkdir -p... /bin/mkdir -p
232checking for gawk... no
233checking for mawk... mawk
234checking whether make sets $(MAKE)... yes
235checking for i386-unknown-linux-gcc... gcc
236checking for C compiler default output file name... a.out
237checking whether the C compiler works... yes
238checking whether we are cross compiling... no
239checking for suffix of executables...
240checking for suffix of object files... o
241checking whether we are using the GNU C compiler... yes
242checking whether gcc accepts -g... yes
243checking for gcc option to accept ISO C89... none needed
244checking for style of include used by make... GNU
245checking dependency style of gcc... gcc3
246checking dependency style of gcc... gcc3
247checking whether gcc and cc understand -c and -o together... yes
248checking for a sed that does not truncate output... /bin/sed
249checking for grep that handles long lines and -e... /bin/grep
250checking for egrep... /bin/grep -E
251checking for ld used by gcc... /usr/bin/ld
252checking if the linker (/usr/bin/ld) is GNU ld... yes
253checking for /usr/bin/ld option to reload object files... -r
254checking for BSD-compatible nm... /usr/bin/nm -B
255checking whether ln -s works... no, using cp -p
256checking how to recognize dependent libraries... pass_all
257checking how to run the C preprocessor... gcc -E
258checking for ANSI C header files... yes
259checking for sys/types.h... yes
260checking for sys/stat.h... yes
261checking for stdlib.h... yes
262checking for string.h... yes
263checking for memory.h... yes
264checking for strings.h... yes
265checking for inttypes.h... yes
266checking for stdint.h... yes
267checking for unistd.h... yes
268checking dlfcn.h usability... yes
269checking dlfcn.h presence... yes
270checking for dlfcn.h... yes
271checking for i386-unknown-linux-g++... no
272checking for i386-unknown-linux-c++... no
273checking for i386-unknown-linux-gpp... no
274checking for i386-unknown-linux-aCC... no
275checking for i386-unknown-linux-CC... no
276checking for i386-unknown-linux-cxx... no
277checking for i386-unknown-linux-cc++... no
278checking for i386-unknown-linux-cl.exe... no
279checking for i386-unknown-linux-FCC... no
280checking for i386-unknown-linux-KCC... no
281checking for i386-unknown-linux-RCC... no
282checking for i386-unknown-linux-xlC_r... no
283checking for i386-unknown-linux-xlC... no
284checking for g++... g++
285checking whether we are using the GNU C++ compiler... yes
286checking whether g++ accepts -g... yes
287checking dependency style of g++... gcc3
288checking how to run the C++ preprocessor... g++ -E
289checking for i386-unknown-linux-g77... no
290checking for i386-unknown-linux-xlf... no
291checking for i386-unknown-linux-f77... no
292checking for i386-unknown-linux-frt... no
293checking for i386-unknown-linux-pgf77... no
294checking for i386-unknown-linux-cf77... no
295checking for i386-unknown-linux-fort77... no
296checking for i386-unknown-linux-fl32... no
297checking for i386-unknown-linux-af77... no
298checking for i386-unknown-linux-xlf90... no
299checking for i386-unknown-linux-f90... no
300checking for i386-unknown-linux-pgf90... no
301checking for i386-unknown-linux-pghpf... no
302checking for i386-unknown-linux-epcf90... no
303checking for i386-unknown-linux-gfortran... no
304checking for i386-unknown-linux-g95... no
305checking for i386-unknown-linux-xlf95... no
306checking for i386-unknown-linux-f95... no
307checking for i386-unknown-linux-fort... no
308checking for i386-unknown-linux-ifort... no
309checking for i386-unknown-linux-ifc... no
310checking for i386-unknown-linux-efc... no
311checking for i386-unknown-linux-pgf95... no
312checking for i386-unknown-linux-lf95... no
313checking for i386-unknown-linux-ftn... no
314checking for g77... no
315checking for xlf... no
316checking for f77... no
317checking for frt... no
318checking for pgf77... no
319checking for cf77... no
320checking for fort77... no
321checking for fl32... no
322checking for af77... no
323checking for xlf90... no
324checking for f90... no
325checking for pgf90... no
326checking for pghpf... no
327checking for epcf90... no
328checking for gfortran... no
329checking for g95... no
330checking for xlf95... no
331checking for f95... no
332checking for fort... no
333checking for ifort... no
334checking for ifc... no
335checking for efc... no
336checking for pgf95... no
337checking for lf95... no
338checking for ftn... no
339checking whether we are using the GNU Fortran 77 compiler... no
340checking whether  accepts -g... no
341checking the maximum length of command line arguments... 98304
342checking command to parse /usr/bin/nm -B output from gcc object... ok
343checking for objdir... .libs
344checking for i386-unknown-linux-ar... no
345checking for ar... ar
346checking for i386-unknown-linux-ranlib... no
347checking for ranlib... ranlib
348checking for i386-unknown-linux-strip... no
349checking for strip... strip
350checking if gcc supports -fno-rtti -fno-exceptions... no
351checking for gcc option to produce PIC... -fPIC
352checking if gcc PIC flag -fPIC works... yes
353checking if gcc static flag -static works... yes
354checking if gcc supports -c -o file.o... yes
355checking whether the gcc linker (/usr/bin/ld) supports shared libraries... yes
356checking whether -lc should be explicitly linked in... no
357checking dynamic linker characteristics... GNU/Linux ld.so
358checking how to hardcode library paths into programs... immediate
359checking whether stripping libraries is possible... yes
360checking if libtool supports shared libraries... yes
361checking whether to build shared libraries... yes
362checking whether to build static libraries... yes
363configure: creating libtool
364appending configuration tag "CXX" to libtool
365checking for ld used by g++... /usr/bin/ld
366checking if the linker (/usr/bin/ld) is GNU ld... yes
367checking whether the g++ linker (/usr/bin/ld) supports shared libraries... yes
368checking for g++ option to produce PIC... -fPIC
369checking if g++ PIC flag -fPIC works... yes
370checking if g++ static flag -static works... yes
371checking if g++ supports -c -o file.o... yes
372checking whether the g++ linker (/usr/bin/ld) supports shared libraries... yes
373checking dynamic linker characteristics... GNU/Linux ld.so
374checking how to hardcode library paths into programs... immediate
375appending configuration tag "F77" to libtool
376checking whether to enable maintainer-specific portions of Makefiles... no
377checking sys/mman.h usability... yes
378checking sys/mman.h presence... yes
379checking for sys/mman.h... yes
380checking for mmap... yes
381checking for sys/mman.h... (cached) yes
382checking for mmap... (cached) yes
383checking whether read-only mmap of a plain file works... yes
384checking whether mmap from /dev/zero works... yes
385checking for MAP_ANON(YMOUS)... yes
386checking whether mmap with MAP_ANON(YMOUS) works... yes
387checking for ANSI C header files... (cached) yes
388checking for memcpy... yes
389checking for working alloca.h... yes
390checking for alloca... yes
391checking for double... yes
392checking size of double... 8
393checking for long double... yes
394checking size of long double... 12
395checking whether byte ordering is bigendian... no
396checking assembler .cfi pseudo-op support... yes
397checking whether .eh_frame section should be read-only... yes
398checking for __attribute__((visibility("hidden")))... yes
399configure: creating ./config.status
400config.status: creating include/Makefile
401config.status: creating include/ffi.h
402config.status: creating Makefile
403config.status: creating testsuite/Makefile
404config.status: creating man/Makefile
405config.status: creating libffi.pc
406config.status: creating fficonfig.h
407config.status: linking ./src/x86/ffitarget.h to include/ffitarget.h
408config.status: executing depfiles commands
409config.status: executing include commands
410config.status: executing src commands
411touch stamp.ffi
412cp build/include/ffi.h .
413make -C build MAKEFLAGS=
414make[2]: Entering directory `/home/michael/Development/junk/ghc-6.10.1/libffi/build'
415make "AR_FLAGS=" "CC_FOR_BUILD=" "CFLAGS=-g -O2" "CXXFLAGS=-g -O2" "CFLAGS_FOR_BUILD=" "CFLAGS_FOR_TARGET=" "INSTALL=/usr/bin/install -c" "INSTALL_DATA=/usr/bin/install -c -m 644" "INSTALL_PROGRAM=/usr/bin/install -c" "INSTALL_SCRIPT=/usr/bin/install -c" "JC1FLAGS=" "LDFLAGS=" "LIBCFLAGS=" "LIBCFLAGS_FOR_TARGET=" "MAKE=make" "MAKEINFO=/bin/bash /home/michael/Development/junk/ghc-6.10.1/libffi/build/missing --run makeinfo " "PICFLAG=" "PICFLAG_FOR_TARGET=" "RUNTESTFLAGS=" "SHELL=/bin/bash" "exec_prefix=/usr/local" "infodir=/usr/local/share/info" "libdir=/usr/local/lib" "prefix=/usr/local" "AR=ar" "AS=as" "CC=gcc" "CXX=g++" "LD=ld" "NM=" "RANLIB=ranlib" "DESTDIR=" all-recursive
416make[3]: Entering directory `/home/michael/Development/junk/ghc-6.10.1/libffi/build'
417Making all in include
418make[4]: Entering directory `/home/michael/Development/junk/ghc-6.10.1/libffi/build/include'
419make[4]: Nothing to be done for `all'.
420make[4]: Leaving directory `/home/michael/Development/junk/ghc-6.10.1/libffi/build/include'
421Making all in testsuite
422make[4]: Entering directory `/home/michael/Development/junk/ghc-6.10.1/libffi/build/testsuite'
423make[4]: Nothing to be done for `all'.
424make[4]: Leaving directory `/home/michael/Development/junk/ghc-6.10.1/libffi/build/testsuite'
425Making all in man
426make[4]: Entering directory `/home/michael/Development/junk/ghc-6.10.1/libffi/build/man'
427make[4]: Nothing to be done for `all'.
428make[4]: Leaving directory `/home/michael/Development/junk/ghc-6.10.1/libffi/build/man'
429make[4]: Entering directory `/home/michael/Development/junk/ghc-6.10.1/libffi/build'
430depbase=`echo src/debug.lo | sed 's|[^/]*$|.deps/&|;s|\.lo$||'`;\
431        /bin/bash ./libtool --tag=CC   --mode=compile gcc -DHAVE_CONFIG_H -I.  -I. -I./include -Iinclude -I./src  -Wall -g -fexceptions -g -O2 -MT src/debug.lo -MD -MP -MF $depbase.Tpo -c -o src/debug.lo src/debug.c &&\
432        mv -f $depbase.Tpo $depbase.Plo
433mkdir src/.libs
434 gcc -DHAVE_CONFIG_H -I. -I. -I./include -Iinclude -I./src -Wall -g -fexceptions -g -O2 -MT src/debug.lo -MD -MP -MF src/.deps/debug.Tpo -c src/debug.c  -fPIC -DPIC -o src/.libs/debug.o
435 gcc -DHAVE_CONFIG_H -I. -I. -I./include -Iinclude -I./src -Wall -g -fexceptions -g -O2 -MT src/debug.lo -MD -MP -MF src/.deps/debug.Tpo -c src/debug.c -o src/debug.o >/dev/null 2>&1
436depbase=`echo src/prep_cif.lo | sed 's|[^/]*$|.deps/&|;s|\.lo$||'`;\
437        /bin/bash ./libtool --tag=CC   --mode=compile gcc -DHAVE_CONFIG_H -I.  -I. -I./include -Iinclude -I./src  -Wall -g -fexceptions -g -O2 -MT src/prep_cif.lo -MD -MP -MF $depbase.Tpo -c -o src/prep_cif.lo src/prep_cif.c &&\
438        mv -f $depbase.Tpo $depbase.Plo
439 gcc -DHAVE_CONFIG_H -I. -I. -I./include -Iinclude -I./src -Wall -g -fexceptions -g -O2 -MT src/prep_cif.lo -MD -MP -MF src/.deps/prep_cif.Tpo -c src/prep_cif.c  -fPIC -DPIC -o src/.libs/prep_cif.o
440 gcc -DHAVE_CONFIG_H -I. -I. -I./include -Iinclude -I./src -Wall -g -fexceptions -g -O2 -MT src/prep_cif.lo -MD -MP -MF src/.deps/prep_cif.Tpo -c src/prep_cif.c -o src/prep_cif.o >/dev/null 2>&1
441depbase=`echo src/types.lo | sed 's|[^/]*$|.deps/&|;s|\.lo$||'`;\
442        /bin/bash ./libtool --tag=CC   --mode=compile gcc -DHAVE_CONFIG_H -I.  -I. -I./include -Iinclude -I./src  -Wall -g -fexceptions -g -O2 -MT src/types.lo -MD -MP -MF $depbase.Tpo -c -o src/types.lo src/types.c &&\
443        mv -f $depbase.Tpo $depbase.Plo
444 gcc -DHAVE_CONFIG_H -I. -I. -I./include -Iinclude -I./src -Wall -g -fexceptions -g -O2 -MT src/types.lo -MD -MP -MF src/.deps/types.Tpo -c src/types.c  -fPIC -DPIC -o src/.libs/types.o
445 gcc -DHAVE_CONFIG_H -I. -I. -I./include -Iinclude -I./src -Wall -g -fexceptions -g -O2 -MT src/types.lo -MD -MP -MF src/.deps/types.Tpo -c src/types.c -o src/types.o >/dev/null 2>&1
446depbase=`echo src/raw_api.lo | sed 's|[^/]*$|.deps/&|;s|\.lo$||'`;\
447        /bin/bash ./libtool --tag=CC   --mode=compile gcc -DHAVE_CONFIG_H -I.  -I. -I./include -Iinclude -I./src  -Wall -g -fexceptions -g -O2 -MT src/raw_api.lo -MD -MP -MF $depbase.Tpo -c -o src/raw_api.lo src/raw_api.c &&\
448        mv -f $depbase.Tpo $depbase.Plo
449 gcc -DHAVE_CONFIG_H -I. -I. -I./include -Iinclude -I./src -Wall -g -fexceptions -g -O2 -MT src/raw_api.lo -MD -MP -MF src/.deps/raw_api.Tpo -c src/raw_api.c  -fPIC -DPIC -o src/.libs/raw_api.o
450 gcc -DHAVE_CONFIG_H -I. -I. -I./include -Iinclude -I./src -Wall -g -fexceptions -g -O2 -MT src/raw_api.lo -MD -MP -MF src/.deps/raw_api.Tpo -c src/raw_api.c -o src/raw_api.o >/dev/null 2>&1
451depbase=`echo src/java_raw_api.lo | sed 's|[^/]*$|.deps/&|;s|\.lo$||'`;\
452        /bin/bash ./libtool --tag=CC   --mode=compile gcc -DHAVE_CONFIG_H -I.  -I. -I./include -Iinclude -I./src  -Wall -g -fexceptions -g -O2 -MT src/java_raw_api.lo -MD -MP -MF $depbase.Tpo -c -o src/java_raw_api.lo src/java_raw_api.c &&\
453        mv -f $depbase.Tpo $depbase.Plo
454 gcc -DHAVE_CONFIG_H -I. -I. -I./include -Iinclude -I./src -Wall -g -fexceptions -g -O2 -MT src/java_raw_api.lo -MD -MP -MF src/.deps/java_raw_api.Tpo -c src/java_raw_api.c  -fPIC -DPIC -o src/.libs/java_raw_api.o
455 gcc -DHAVE_CONFIG_H -I. -I. -I./include -Iinclude -I./src -Wall -g -fexceptions -g -O2 -MT src/java_raw_api.lo -MD -MP -MF src/.deps/java_raw_api.Tpo -c src/java_raw_api.c -o src/java_raw_api.o >/dev/null 2>&1
456depbase=`echo src/closures.lo | sed 's|[^/]*$|.deps/&|;s|\.lo$||'`;\
457        /bin/bash ./libtool --tag=CC   --mode=compile gcc -DHAVE_CONFIG_H -I.  -I. -I./include -Iinclude -I./src  -Wall -g -fexceptions -g -O2 -MT src/closures.lo -MD -MP -MF $depbase.Tpo -c -o src/closures.lo src/closures.c &&\
458        mv -f $depbase.Tpo $depbase.Plo
459 gcc -DHAVE_CONFIG_H -I. -I. -I./include -Iinclude -I./src -Wall -g -fexceptions -g -O2 -MT src/closures.lo -MD -MP -MF src/.deps/closures.Tpo -c src/closures.c  -fPIC -DPIC -o src/.libs/closures.o
460 gcc -DHAVE_CONFIG_H -I. -I. -I./include -Iinclude -I./src -Wall -g -fexceptions -g -O2 -MT src/closures.lo -MD -MP -MF src/.deps/closures.Tpo -c src/closures.c -o src/closures.o >/dev/null 2>&1
461depbase=`echo src/x86/ffi.lo | sed 's|[^/]*$|.deps/&|;s|\.lo$||'`;\
462        /bin/bash ./libtool --tag=CC   --mode=compile gcc -DHAVE_CONFIG_H -I.  -I. -I./include -Iinclude -I./src  -Wall -g -fexceptions -g -O2 -MT src/x86/ffi.lo -MD -MP -MF $depbase.Tpo -c -o src/x86/ffi.lo src/x86/ffi.c &&\
463        mv -f $depbase.Tpo $depbase.Plo
464mkdir src/x86/.libs
465 gcc -DHAVE_CONFIG_H -I. -I. -I./include -Iinclude -I./src -Wall -g -fexceptions -g -O2 -MT src/x86/ffi.lo -MD -MP -MF src/x86/.deps/ffi.Tpo -c src/x86/ffi.c  -fPIC -DPIC -o src/x86/.libs/ffi.o
466 gcc -DHAVE_CONFIG_H -I. -I. -I./include -Iinclude -I./src -Wall -g -fexceptions -g -O2 -MT src/x86/ffi.lo -MD -MP -MF src/x86/.deps/ffi.Tpo -c src/x86/ffi.c -o src/x86/ffi.o >/dev/null 2>&1
467depbase=`echo src/x86/sysv.lo | sed 's|[^/]*$|.deps/&|;s|\.lo$||'`;\
468        /bin/bash ./libtool   --mode=compile gcc -DHAVE_CONFIG_H -I.  -I. -I./include -Iinclude -I./src  -I. -I./include -Iinclude -I./src -g -O2 -MT src/x86/sysv.lo -MD -MP -MF $depbase.Tpo -c -o src/x86/sysv.lo src/x86/sysv.S &&\
469        mv -f $depbase.Tpo $depbase.Plo
470 gcc -DHAVE_CONFIG_H -I. -I. -I./include -Iinclude -I./src -I. -I./include -Iinclude -I./src -g -O2 -MT src/x86/sysv.lo -MD -MP -MF src/x86/.deps/sysv.Tpo -c src/x86/sysv.S  -fPIC -DPIC -o src/x86/.libs/sysv.o
471 gcc -DHAVE_CONFIG_H -I. -I. -I./include -Iinclude -I./src -I. -I./include -Iinclude -I./src -g -O2 -MT src/x86/sysv.lo -MD -MP -MF src/x86/.deps/sysv.Tpo -c src/x86/sysv.S -o src/x86/sysv.o >/dev/null 2>&1
472/bin/bash ./libtool --tag=CC   --mode=link gcc -Wall -g -fexceptions -g -O2 -version-info `grep -v '^#' ./libtool-version`  -o libffi.la -rpath /usr/local/lib src/debug.lo src/prep_cif.lo src/types.lo src/raw_api.lo src/java_raw_api.lo src/closures.lo  src/x86/ffi.lo src/x86/sysv.lo                       
473mkdir .libs
474gcc -shared  src/.libs/debug.o src/.libs/prep_cif.o src/.libs/types.o src/.libs/raw_api.o src/.libs/java_raw_api.o src/.libs/closures.o src/x86/.libs/ffi.o src/x86/.libs/sysv.o   -Wl,-soname -Wl,libffi.so.5 -o .libs/libffi.so.5.0.5
475(cd .libs && rm -f libffi.so.5 && cp -p libffi.so.5.0.5 libffi.so.5)
476(cd .libs && rm -f libffi.so && cp -p libffi.so.5.0.5 libffi.so)
477ar cru .libs/libffi.a  src/debug.o src/prep_cif.o src/types.o src/raw_api.o src/java_raw_api.o src/closures.o src/x86/ffi.o src/x86/sysv.o
478ranlib .libs/libffi.a
479creating libffi.la
480(cd .libs && rm -f libffi.la && cp -p ../libffi.la libffi.la)
481/bin/bash ./libtool --tag=CC   --mode=link gcc -Wall -g -fexceptions -g -O2   -o libffi_convenience.la  src/debug.lo src/prep_cif.lo src/types.lo src/raw_api.lo src/java_raw_api.lo src/closures.lo  src/x86/ffi.lo src/x86/sysv.lo                       
482ar cru .libs/libffi_convenience.a src/.libs/debug.o src/.libs/prep_cif.o src/.libs/types.o src/.libs/raw_api.o src/.libs/java_raw_api.o src/.libs/closures.o src/x86/.libs/ffi.o src/x86/.libs/sysv.o
483ranlib .libs/libffi_convenience.a
484creating libffi_convenience.la
485(cd .libs && rm -f libffi_convenience.la && cp -p ../libffi_convenience.la libffi_convenience.la)
486make[4]: Leaving directory `/home/michael/Development/junk/ghc-6.10.1/libffi/build'
487make[3]: Leaving directory `/home/michael/Development/junk/ghc-6.10.1/libffi/build'
488make[2]: Leaving directory `/home/michael/Development/junk/ghc-6.10.1/libffi/build'
489(cd build; ./libtool --mode=install cp libffi.la /home/michael/Development/junk/ghc-6.10.1/libffi)
490cp .libs/libffi.so.5.0.5 /home/michael/Development/junk/ghc-6.10.1/libffi/libffi.so.5.0.5
491(cd /home/michael/Development/junk/ghc-6.10.1/libffi && { cp -p -f libffi.so.5.0.5 libffi.so.5 || { rm -f libffi.so.5 && cp -p libffi.so.5.0.5 libffi.so.5; }; })
492(cd /home/michael/Development/junk/ghc-6.10.1/libffi && { cp -p -f libffi.so.5.0.5 libffi.so || { rm -f libffi.so && cp -p libffi.so.5.0.5 libffi.so; }; })
493cp .libs/libffi.lai /home/michael/Development/junk/ghc-6.10.1/libffi/libffi.la
494cp .libs/libffi.a /home/michael/Development/junk/ghc-6.10.1/libffi/libffi.a
495chmod 644 /home/michael/Development/junk/ghc-6.10.1/libffi/libffi.a
496ranlib /home/michael/Development/junk/ghc-6.10.1/libffi/libffi.a
497libtool: install: warning: remember to run `libtool --finish /usr/local/lib'
498make[1]: Leaving directory `/home/michael/Development/junk/ghc-6.10.1/libffi'
499make -C utils/mkdependC boot
500make[1]: Entering directory `/home/michael/Development/junk/ghc-6.10.1/utils/mkdependC'
501rm -f -f mkdependC
502echo '#!/usr/bin/perl'                               >> mkdependC
503echo '$DEFAULT_TMPDIR = "/tmp";' >> mkdependC
504echo '$CPP            = "gcc -E ";'            >> mkdependC
505echo '$BUILDPLATFORM  = "i386-unknown-linux";'  >> mkdependC
506cat mkdependC.prl                                >> mkdependC
507chmod +x mkdependC
508make[1]: Leaving directory `/home/michael/Development/junk/ghc-6.10.1/utils/mkdependC'
509make -C utils with-bootstrapping-compiler
510make[1]: Entering directory `/home/michael/Development/junk/ghc-6.10.1/utils'
511make -C installPackage with-bootstrapping-compiler
512make[2]: Entering directory `/home/michael/Development/junk/ghc-6.10.1/utils/installPackage'
513/home/michael/Development/junk/ghc-6.10.1/libraries/cabal-bin /home/michael/software/bin/ghc /home/michael/Development/junk/ghc-6.10.1/libraries/bootstrapping.conf configure --distpref dist-inplace          \
514                           --prefix=`/home/michael/Development/junk/ghc-6.10.1/utils/pwd/pwd forwardslash`/install-inplace  \
515                           --with-compiler=/home/michael/software/bin/ghc --with-hc-pkg=/home/michael/software/bin/ghc-pkg --package-db /home/michael/Development/junk/ghc-6.10.1/libraries/bootstrapping.conf      \
516                           --libsubdir='$pkgid' --with-gcc=gcc --with-ld=/usr/bin/ld  --with-alex=/home/michael/software/bin/alex --with-happy=/home/michael/software/bin/happy    --configure-option='--prefix=/home/michael/software'  --configure-option='--enable-shared' --configure-option=--with-cc=gcc         \
517                           --constraint="Cabal == 1.6.0.1"
518Configuring installPackage-1.0...
519/home/michael/Development/junk/ghc-6.10.1/libraries/cabal-bin /home/michael/software/bin/ghc /home/michael/Development/junk/ghc-6.10.1/libraries/bootstrapping.conf build     --distpref dist-inplace --ghc-option=-H32m --ghc-option=-O --ghc-option=-Wall
520Preprocessing executables for installPackage-1.0...
521Building installPackage-1.0...
522[1 of 1] Compiling Main             ( installPackage.hs, dist-inplace/build/installPackage/installPackage-tmp/Main.o )
523Linking dist-inplace/build/installPackage/installPackage ...
524/home/michael/Development/junk/ghc-6.10.1/libraries/cabal-bin /home/michael/software/bin/ghc /home/michael/Development/junk/ghc-6.10.1/libraries/bootstrapping.conf install   --distpref dist-inplace
525Installing executable(s) in
526/home/michael/Development/junk/ghc-6.10.1/utils/installPackage/install-inplace/bin
527make[2]: Leaving directory `/home/michael/Development/junk/ghc-6.10.1/utils/installPackage'
528make -C ghc-pkg with-bootstrapping-compiler
529make[2]: Entering directory `/home/michael/Development/junk/ghc-6.10.1/utils/ghc-pkg'
530rm -f -f Version.hs
531echo "module Version where"                    >> Version.hs
532echo "version, targetOS, targetARCH :: String" >> Version.hs
533echo "version    = \"6.10.1\""      >> Version.hs
534echo "targetOS   = \"linux\""        >> Version.hs
535echo "targetARCH = \"i386\""      >> Version.hs
536/home/michael/Development/junk/ghc-6.10.1/libraries/cabal-bin /home/michael/software/bin/ghc /home/michael/Development/junk/ghc-6.10.1/libraries/bootstrapping.conf configure --distpref dist-inplace          \
537                           --prefix=`/home/michael/Development/junk/ghc-6.10.1/utils/pwd/pwd forwardslash`/install-inplace  \
538                           --with-compiler=/home/michael/software/bin/ghc --with-hc-pkg=/home/michael/software/bin/ghc-pkg --package-db /home/michael/Development/junk/ghc-6.10.1/libraries/bootstrapping.conf      \
539                           --libsubdir='$pkgid' --with-gcc=gcc --with-ld=/usr/bin/ld  --with-alex=/home/michael/software/bin/alex --with-happy=/home/michael/software/bin/happy    --configure-option='--prefix=/home/michael/software'  --configure-option='--enable-shared' --configure-option=--with-cc=gcc         \
540                           --datadir=/home/michael/Development/junk/ghc-6.10.1/inplace-datadir --datasubdir=.
541
542.
543.       ELIDED HEAVILY
544.
545                           
546== Finished recursively making `all' for ways: p dyn ...
547make[2]: Leaving directory `/home/michael/Development/junk/ghc-6.10.1/libraries/integer-gmp'
548Registering integer-0.1.0.0...
549Reading package info from "dist/inplace-pkg-config" ... done.
550Writing new package config file... done.
551rm -f -f stamp/configure.library.*.base base/unbuildable
552../utils/mkdirhier/mkdirhier `dirname stamp/configure.library.build-profiling-shared-splitting.base`
553( cd base && /home/michael/Development/junk/ghc-6.10.1/libraries/cabal-bin /home/michael/software/bin/ghc /home/michael/Development/junk/ghc-6.10.1/libraries/bootstrapping.conf configure --prefix=/NONEXISTENT --bindir=/NONEXISTENT --libdir=/NONEXISTENT --libexecdir=/NONEXISTENT --datadir=/NONEXISTENT --docdir=/NONEXISTENT --haddockdir=/NONEXISTENT --htmldir=/NONEXISTENT --with-compiler=/home/michael/Development/junk/ghc-6.10.1/ghc/stage1-inplace/ghc --with-hc-pkg=/home/michael/Development/junk/ghc-6.10.1/utils/ghc-pkg/install-inplace/bin/ghc-pkg   --libsubdir='$pkgid' --with-gcc=gcc --with-ld=/usr/bin/ld  --with-alex=/home/michael/software/bin/alex --with-happy=/home/michael/software/bin/happy    --configure-option='--prefix=/home/michael/software'  --configure-option='--enable-shared' --configure-option=--with-cc=gcc --with-hsc2hs=/home/michael/Development/junk/ghc-6.10.1/utils/hsc2hs/install-inplace/bin/hsc2hs --haddock-options="--use-contents=../index.html --use-index=../doc-index.html"  --enable-library-profiling --enable-shared --enable-split-objs ) \
554              && touch stamp/configure.library.build-profiling-shared-splitting.base || touch base/unbuildable
555Configuring base-4.0.0.0...
556checking for gcc... gcc
557checking for C compiler default output file name... a.out
558checking whether the C compiler works... yes
559checking whether we are cross compiling... no
560checking for suffix of executables...
561checking for suffix of object files... o
562checking whether we are using the GNU C compiler... yes
563checking whether gcc accepts -g... yes
564checking for gcc option to accept ISO C89... none needed
565checking how to run the C preprocessor... gcc -E
566checking for grep that handles long lines and -e... /bin/grep
567checking for egrep... /bin/grep -E
568checking for ANSI C header files... yes
569checking for sys/types.h... yes
570checking for sys/stat.h... yes
571checking for stdlib.h... yes
572checking for string.h... yes
573checking for memory.h... yes
574checking for strings.h... yes
575checking for inttypes.h... yes
576checking for stdint.h... yes
577checking for unistd.h... yes
578checking for long long... yes
579checking for an ANSI C-conforming const... yes
580checking for ANSI C header files... (cached) yes
581checking ctype.h usability... yes
582checking ctype.h presence... yes
583checking for ctype.h... yes
584checking dirent.h usability... yes
585checking dirent.h presence... yes
586checking for dirent.h... yes
587checking errno.h usability... yes
588checking errno.h presence... yes
589checking for errno.h... yes
590checking fcntl.h usability... yes
591checking fcntl.h presence... yes
592checking for fcntl.h... yes
593checking for inttypes.h... (cached) yes
594checking limits.h usability... yes
595checking limits.h presence... yes
596checking for limits.h... yes
597checking signal.h usability... yes
598checking signal.h presence... yes
599checking for signal.h... yes
600checking sys/resource.h usability... yes
601checking sys/resource.h presence... yes
602checking for sys/resource.h... yes
603checking sys/select.h usability... yes
604checking sys/select.h presence... yes
605checking for sys/select.h... yes
606checking for sys/stat.h... (cached) yes
607checking sys/syscall.h usability... yes
608checking sys/syscall.h presence... yes
609checking for sys/syscall.h... yes
610checking sys/time.h usability... yes
611checking sys/time.h presence... yes
612checking for sys/time.h... yes
613checking sys/timeb.h usability... yes
614checking sys/timeb.h presence... yes
615checking for sys/timeb.h... yes
616checking sys/timers.h usability... no
617checking sys/timers.h presence... no
618checking for sys/timers.h... no
619checking sys/times.h usability... yes
620checking sys/times.h presence... yes
621checking for sys/times.h... yes
622checking for sys/types.h... (cached) yes
623checking sys/utsname.h usability... yes
624checking sys/utsname.h presence... yes
625checking for sys/utsname.h... yes
626checking sys/wait.h usability... yes
627checking sys/wait.h presence... yes
628checking for sys/wait.h... yes
629checking termios.h usability... yes
630checking termios.h presence... yes
631checking for termios.h... yes
632checking time.h usability... yes
633checking time.h presence... yes
634checking for time.h... yes
635checking for unistd.h... (cached) yes
636checking utime.h usability... yes
637checking utime.h presence... yes
638checking for utime.h... yes
639checking windows.h usability... no
640checking windows.h presence... no
641checking for windows.h... no
642checking winsock.h usability... no
643checking winsock.h presence... no
644checking for winsock.h... no
645checking for special C compiler options needed for large files... no
646checking for _FILE_OFFSET_BITS value needed for large files... 64
647checking wctype.h usability... yes
648checking wctype.h presence... yes
649checking for wctype.h... yes
650checking for iswspace... yes
651checking for lstat... yes
652checking for readdir_r... yes
653checking for getclock... no
654checking for getrusage... yes
655checking for times... yes
656checking for _chsize... no
657checking for ftruncate... yes
658checking Haskell type for char... Int8
659checking Haskell type for signed char... Int8
660checking Haskell type for unsigned char... Word8
661checking Haskell type for short... Int16
662checking Haskell type for unsigned short... Word16
663checking Haskell type for int... Int32
664checking Haskell type for unsigned int... Word32
665checking Haskell type for long... Int32
666checking Haskell type for unsigned long... Word32
667checking Haskell type for long long... Int64
668checking Haskell type for unsigned long long... Word64
669checking Haskell type for float... Float
670checking Haskell type for double... Double
671checking Haskell type for ptrdiff_t... Int32
672checking Haskell type for size_t... Word32
673checking Haskell type for wchar_t... Int32
674checking Haskell type for sig_atomic_t... Int32
675checking Haskell type for clock_t... Int32
676checking Haskell type for time_t... Int32
677checking Haskell type for dev_t... Word64
678checking Haskell type for ino_t... Word64
679checking Haskell type for mode_t... Word32
680checking Haskell type for off_t... Int64
681checking Haskell type for pid_t... Int32
682checking Haskell type for gid_t... Word32
683checking Haskell type for uid_t... Word32
684checking Haskell type for cc_t... Word8
685checking Haskell type for speed_t... Word32
686checking Haskell type for tcflag_t... Word32
687checking Haskell type for nlink_t... Word32
688checking Haskell type for ssize_t... Int32
689checking Haskell type for rlim_t... Word64
690checking Haskell type for wint_t... not supported
691checking Haskell type for intptr_t... Int32
692checking Haskell type for uintptr_t... Word32
693checking Haskell type for intmax_t... Int64
694checking Haskell type for uintmax_t... Word64
695checking value of E2BIG... 7
696checking value of EACCES... 13
697checking value of EADDRINUSE... 98
698checking value of EADDRNOTAVAIL... 99
699checking value of EADV... 68
700checking value of EAFNOSUPPORT... 97
701checking value of EAGAIN... 11
702checking value of EALREADY... 114
703checking value of EBADF... 9
704checking value of EBADMSG... 74
705checking value of EBADRPC... -1
706checking value of EBUSY... 16
707checking value of ECHILD... 10
708checking value of ECOMM... 70
709checking value of ECONNABORTED... 103
710checking value of ECONNREFUSED... 111
711checking value of ECONNRESET... 104
712checking value of EDEADLK... 35
713checking value of EDESTADDRREQ... 89
714checking value of EDIRTY... -1
715checking value of EDOM... 33
716checking value of EDQUOT... 122
717checking value of EEXIST... 17
718checking value of EFAULT... 14
719checking value of EFBIG... 27
720checking value of EFTYPE... -1
721checking value of EHOSTDOWN... 112
722checking value of EHOSTUNREACH... 113
723checking value of EIDRM... 43
724checking value of EILSEQ... 84
725checking value of EINPROGRESS... 115
726checking value of EINTR... 4
727checking value of EINVAL... 22
728checking value of EIO... 5
729checking value of EISCONN... 106
730checking value of EISDIR... 21
731checking value of ELOOP... 40
732checking value of EMFILE... 24
733checking value of EMLINK... 31
734checking value of EMSGSIZE... 90
735checking value of EMULTIHOP... 72
736checking value of ENAMETOOLONG... 36
737checking value of ENETDOWN... 100
738checking value of ENETRESET... 102
739checking value of ENETUNREACH... 101
740checking value of ENFILE... 23
741checking value of ENOBUFS... 105
742checking value of ENODATA... 61
743checking value of ENODEV... 19
744checking value of ENOENT... 2
745checking value of ENOEXEC... 8
746checking value of ENOLCK... 37
747checking value of ENOLINK... 67
748checking value of ENOMEM... 12
749checking value of ENOMSG... 42
750checking value of ENONET... 64
751checking value of ENOPROTOOPT... 92
752checking value of ENOSPC... 28
753checking value of ENOSR... 63
754checking value of ENOSTR... 60
755checking value of ENOSYS... 38
756checking value of ENOTBLK... 15
757checking value of ENOTCONN... 107
758checking value of ENOTDIR... 20
759checking value of ENOTEMPTY... 39
760checking value of ENOTSOCK... 88
761checking value of ENOTTY... 25
762checking value of ENXIO... 6
763checking value of EOPNOTSUPP... 95
764checking value of EPERM... 1
765checking value of EPFNOSUPPORT... 96
766checking value of EPIPE... 32
767checking value of EPROCLIM... -1
768checking value of EPROCUNAVAIL... -1
769checking value of EPROGMISMATCH... -1
770checking value of EPROGUNAVAIL... -1
771checking value of EPROTO... 71
772checking value of EPROTONOSUPPORT... 93
773checking value of EPROTOTYPE... 91
774checking value of ERANGE... 34
775checking value of EREMCHG... 78
776checking value of EREMOTE... 66
777checking value of EROFS... 30
778checking value of ERPCMISMATCH... -1
779checking value of ERREMOTE... -1
780checking value of ESHUTDOWN... 108
781checking value of ESOCKTNOSUPPORT... 94
782checking value of ESPIPE... 29
783checking value of ESRCH... 3
784checking value of ESRMNT... 69
785checking value of ESTALE... 116
786checking value of ETIME... 62
787checking value of ETIMEDOUT... 110
788checking value of ETOOMANYREFS... 109
789checking value of ETXTBSY... 26
790checking value of EUSERS... 87
791checking value of EWOULDBLOCK... 11
792checking value of EXDEV... 18
793checking value of ENOCIGAR... -1
794checking value of SIGINT... 2
795checking value of O_BINARY... 0
796checking what readdir sets errno to upon EOF... 0
797configure: creating ./config.status
798config.status: creating include/HsBaseConfig.h
799if ifBuildable/ifBuildable /home/michael/Development/junk/ghc-6.10.1/packages base; then \
800          cd base && \
801          cmp -s /home/michael/Development/junk/ghc-6.10.1/libraries/Makefile.local Makefile.local || cp /home/michael/Development/junk/ghc-6.10.1/libraries/Makefile.local .; \
802          mv GNUmakefile GNUmakefile.tmp; \
803          /home/michael/Development/junk/ghc-6.10.1/libraries/cabal-bin /home/michael/software/bin/ghc /home/michael/Development/junk/ghc-6.10.1/libraries/bootstrapping.conf makefile -f GNUmakefile; \
804          cmp -s GNUmakefile GNUmakefile.tmp && mv GNUmakefile.tmp GNUmakefile; \
805          make -wr && \
806          /home/michael/Development/junk/ghc-6.10.1/libraries/cabal-bin /home/michael/software/bin/ghc /home/michael/Development/junk/ghc-6.10.1/libraries/bootstrapping.conf register --inplace; \
807        fi
808mv: cannot stat `GNUmakefile': No such file or directory
809Preprocessing library base-4.0.0.0...
810dist/build/System/CPUTime_hsc_make: error while loading shared libraries: libffi.so.5: cannot open shared object file: No such file or directory
811running dist/build/System/CPUTime_hsc_make failed
812command was: dist/build/System/CPUTime_hsc_make  >dist/build/System/CPUTime.hs
813make[2]: Entering directory `/home/michael/Development/junk/ghc-6.10.1/libraries/base'
814make[2]: *** No targets specified and no makefile found.  Stop.
815make[2]: Leaving directory `/home/michael/Development/junk/ghc-6.10.1/libraries/base'
816make[1]: *** [make.library.base] Error 2
817make[1]: Leaving directory `/home/michael/Development/junk/ghc-6.10.1/libraries'
818make: *** [stage1] Error 2