Ticket #1876: buildlog-noprof

File buildlog-noprof, 3.3 KB (added by juhpetersen, 5 years ago)

build error without prof

Line 
1== Finished recursively making `all' for ways: dyn ...
2make[3]: ディレクトリ `/home/petersen/ghc/devel/ghc-6.10.1.20090303/compiler' から出ます
3/home/petersen/ghc/devel/ghc-6.10.1.20090303/libraries/cabal-bin /usr/bin/ghc /home/petersen/ghc/devel/ghc-6.10.1.20090303/libraries/bootstrapping.conf 1.6.0.2 register  --distpref dist-stage2 --inplace
4Registering ghc-6.10.1.20090303...
5Reading package info from "dist-stage2/inplace-pkg-config" ... done.
6Writing new package config file... done.
7make -C ../ghc stage=2
8make[3]: ディレクトリ `/home/petersen/ghc/devel/ghc-6.10.1.20090303/ghc' に入ります
9/home/petersen/ghc/devel/ghc-6.10.1.20090303/libraries/cabal-bin /usr/bin/ghc /home/petersen/ghc/devel/ghc-6.10.1.20090303/libraries/bootstrapping.conf 1.6.0.2 configure --distpref dist-stage2         \
10                           --prefix=/NONEXISTENT --bindir=/NONEXISTENT --libdir=/NONEXISTENT --libexecdir=/NONEXISTENT --datadir=/NONEXISTENT --docdir=/NONEXISTENT --haddockdir=/NONEXISTENT --htmldir=/NONEXISTENT \
11                           --flags=ghci --ghc-option=-threaded --ghc-option=-dynamic --with-compiler=/home/petersen/ghc/devel/ghc-6.10.1.20090303/ghc/stage1-inplace/ghc --with-hc-pkg=/home/petersen/ghc/devel/ghc-6.10.1.20090303/utils/ghc-pkg/install-inplace/bin/ghc-pkg    --ghc-option=-O2      \
12                           --libsubdir='$pkgid' --with-gcc=gcc --with-ld=/usr/bin/ld  --with-happy="/usr/bin/happy"    --configure-option='--prefix=/usr'  --configure-option='--exec-prefix=/usr'  --configure-option='--bindir=/usr/bin'  --configure-option='--sbindir=/usr/sbin'  --configure-option='--sysconfdir=/etc'  --configure-option='--datadir=/usr/share'  --configure-option='--includedir=/usr/include'  --configure-option='--libdir=/usr/lib'  --configure-option='--libexecdir=/usr/libexec'  --configure-option='--localstatedir=/var'  --configure-option='--sharedstatedir=/var/lib'  --configure-option='--mandir=/usr/share/man'  --configure-option='--enable-shared' --configure-option=--with-cc="gcc" --with-hsc2hs=/home/petersen/ghc/devel/ghc-6.10.1.20090303/utils/hsc2hs/install-inplace/bin/hsc2hs       \
13                           --libsubdir=.                   \
14                           --datadir='$libdir'            \
15                           --datasubdir=.
16Configuring ghc-bin-6.10.1.20090303...
17/home/petersen/ghc/devel/ghc-6.10.1.20090303/libraries/cabal-bin /usr/bin/ghc /home/petersen/ghc/devel/ghc-6.10.1.20090303/libraries/bootstrapping.conf 1.6.0.2 build     --distpref dist-stage2 --ghc-option=-H32m --ghc-option=-O  --ghc-option=-H32m  --ghc-option=-O
18Preprocessing executables for ghc-bin-6.10.1.20090303...
19Building ghc-bin-6.10.1.20090303...
20[1 of 1] Compiling Main             ( Main.hs, dist-stage2/build/ghc/ghc-tmp/Main.o )
21Linking dist-stage2/build/ghc/ghc ...
22/usr/bin/ld: cannot find -lHSrts_thr-ghc6.10.1.20090303
23collect2: ld はステータス 1 で終了しました
24make[3]: *** [build.stage.2] エラー 1
25make[3]: ディレクトリ `/home/petersen/ghc/devel/ghc-6.10.1.20090303/ghc' から出ます
26make[2]: *** [build.stage.2] エラー 2
27make[2]: ディレクトリ `/home/petersen/ghc/devel/ghc-6.10.1.20090303/compiler' から出ます
28make[1]: *** [stage2] エラー 2
29make[1]: ディレクトリ `/home/petersen/ghc/devel/ghc-6.10.1.20090303' から出ます
30make: *** [bootstrap2] エラー 2
31エラー: /var/tmp/rpm-tmp.tSbPU6 の不正な終了ステータス (%build)