Ticket #1876: buildlog-head-noprof

File buildlog-head-noprof, 17.0 KB (added by juhpetersen, 5 years ago)

same error with HEAD without prof (in English;)

Line 
1/home/petersen/ghc/devel/ghc-6.11.20090305/ghc/stage1-inplace/ghc -shared -dynamic -no-auto-link-packages -o dist-stage2/build/libHSghc-6.11.20090305-ghc6.11.20090305.so dist-stage2/build/ghci/keepCAFsForGHCi.dyn_o dist-stage2/build/parser/cutils.dyn_o dist-stage2/build/utils/md5.dyn_o dist-stage2/build/AsmCodeGen.dyn_o dist-stage2/build/TargetReg.dyn_o dist-stage2/build/NCGMonad.dyn_o dist-stage2/build/Instruction.dyn_o dist-stage2/build/Size.dyn_o dist-stage2/build/Reg.dyn_o dist-stage2/build/RegClass.dyn_o dist-stage2/build/PprBase.dyn_o dist-stage2/build/PIC.dyn_o dist-stage2/build/Platform.dyn_o dist-stage2/build/Alpha/Regs.dyn_o dist-stage2/build/Alpha/RegInfo.dyn_o dist-stage2/build/Alpha/Instr.dyn_o dist-stage2/build/Alpha/CodeGen.dyn_o dist-stage2/build/X86/Regs.dyn_o dist-stage2/build/X86/RegInfo.dyn_o dist-stage2/build/X86/Instr.dyn_o dist-stage2/build/X86/Cond.dyn_o dist-stage2/build/X86/Ppr.dyn_o dist-stage2/build/X86/CodeGen.dyn_o dist-stage2/build/PPC/Regs.dyn_o dist-stage2/build/PPC/RegInfo.dyn_o dist-stage2/build/PPC/Instr.dyn_o dist-stage2/build/PPC/Cond.dyn_o dist-stage2/build/PPC/Ppr.dyn_o dist-stage2/build/PPC/CodeGen.dyn_o dist-stage2/build/SPARC/Base.dyn_o dist-stage2/build/SPARC/Regs.dyn_o dist-stage2/build/SPARC/Imm.dyn_o dist-stage2/build/SPARC/AddrMode.dyn_o dist-stage2/build/SPARC/Cond.dyn_o dist-stage2/build/SPARC/Instr.dyn_o dist-stage2/build/SPARC/Stack.dyn_o dist-stage2/build/SPARC/ShortcutJump.dyn_o dist-stage2/build/SPARC/Ppr.dyn_o dist-stage2/build/SPARC/CodeGen.dyn_o dist-stage2/build/SPARC/CodeGen/Amode.dyn_o dist-stage2/build/SPARC/CodeGen/Base.dyn_o dist-stage2/build/SPARC/CodeGen/CCall.dyn_o dist-stage2/build/SPARC/CodeGen/CondCode.dyn_o dist-stage2/build/SPARC/CodeGen/Gen32.dyn_o dist-stage2/build/SPARC/CodeGen/Gen64.dyn_o dist-stage2/build/SPARC/CodeGen/Sanity.dyn_o dist-stage2/build/RegAlloc/Liveness.dyn_o dist-stage2/build/RegAlloc/Graph/Main.dyn_o dist-stage2/build/RegAlloc/Graph/Stats.dyn_o dist-stage2/build/RegAlloc/Graph/ArchBase.dyn_o dist-stage2/build/RegAlloc/Graph/ArchX86.dyn_o dist-stage2/build/RegAlloc/Graph/Coalesce.dyn_o dist-stage2/build/RegAlloc/Graph/Spill.dyn_o dist-stage2/build/RegAlloc/Graph/SpillClean.dyn_o dist-stage2/build/RegAlloc/Graph/SpillCost.dyn_o dist-stage2/build/RegAlloc/Graph/TrivColorable.dyn_o dist-stage2/build/RegAlloc/Linear/Main.dyn_o dist-stage2/build/RegAlloc/Linear/JoinToTargets.dyn_o dist-stage2/build/RegAlloc/Linear/State.dyn_o dist-stage2/build/RegAlloc/Linear/Stats.dyn_o dist-stage2/build/RegAlloc/Linear/FreeRegs.dyn_o dist-stage2/build/RegAlloc/Linear/StackMap.dyn_o dist-stage2/build/RegAlloc/Linear/Base.dyn_o dist-stage2/build/RegAlloc/Linear/X86/FreeRegs.dyn_o dist-stage2/build/RegAlloc/Linear/PPC/FreeRegs.dyn_o dist-stage2/build/RegAlloc/Linear/SPARC/FreeRegs.dyn_o dist-stage2/build/DsMeta.dyn_o dist-stage2/build/TcSplice.dyn_o dist-stage2/build/Convert.dyn_o dist-stage2/build/ByteCodeAsm.dyn_o dist-stage2/build/ByteCodeFFI.dyn_o dist-stage2/build/ByteCodeGen.dyn_o dist-stage2/build/ByteCodeInstr.dyn_o dist-stage2/build/ByteCodeItbls.dyn_o dist-stage2/build/ByteCodeLink.dyn_o dist-stage2/build/Debugger.dyn_o dist-stage2/build/GhciMonad.dyn_o dist-stage2/build/GhciTags.dyn_o dist-stage2/build/InteractiveUI.dyn_o dist-stage2/build/LibFFI.dyn_o dist-stage2/build/Linker.dyn_o dist-stage2/build/ObjLink.dyn_o dist-stage2/build/RtClosureInspect.dyn_o dist-stage2/build/BasicTypes.dyn_o dist-stage2/build/DataCon.dyn_o dist-stage2/build/Demand.dyn_o dist-stage2/build/Exception.dyn_o dist-stage2/build/Id.dyn_o dist-stage2/build/IdInfo.dyn_o dist-stage2/build/Literal.dyn_o dist-stage2/build/MkId.dyn_o dist-stage2/build/Module.dyn_o dist-stage2/build/Name.dyn_o dist-stage2/build/NameEnv.dyn_o dist-stage2/build/NameSet.dyn_o dist-stage2/build/NewDemand.dyn_o dist-stage2/build/OccName.dyn_o dist-stage2/build/RdrName.dyn_o dist-stage2/build/SrcLoc.dyn_o dist-stage2/build/UniqSupply.dyn_o dist-stage2/build/Unique.dyn_o dist-stage2/build/Var.dyn_o dist-stage2/build/VarEnv.dyn_o dist-stage2/build/VarSet.dyn_o dist-stage2/build/BlockId.dyn_o dist-stage2/build/CLabel.dyn_o dist-stage2/build/Cmm.dyn_o dist-stage2/build/CmmBrokenBlock.dyn_o dist-stage2/build/CmmBuildInfoTables.dyn_o dist-stage2/build/CmmCPS.dyn_o dist-stage2/build/CmmCPSGen.dyn_o dist-stage2/build/CmmCPSZ.dyn_o dist-stage2/build/CmmCallConv.dyn_o dist-stage2/build/CmmCommonBlockElimZ.dyn_o dist-stage2/build/CmmContFlowOpt.dyn_o dist-stage2/build/CmmCvt.dyn_o dist-stage2/build/CmmExpr.dyn_o dist-stage2/build/CmmInfo.dyn_o dist-stage2/build/CmmLex.dyn_o dist-stage2/build/CmmLint.dyn_o dist-stage2/build/CmmLive.dyn_o dist-stage2/build/CmmLiveZ.dyn_o dist-stage2/build/CmmOpt.dyn_o dist-stage2/build/CmmParse.dyn_o dist-stage2/build/CmmProcPoint.dyn_o dist-stage2/build/CmmProcPointZ.dyn_o dist-stage2/build/CmmSpillReload.dyn_o dist-stage2/build/CmmStackLayout.dyn_o dist-stage2/build/CmmTx.dyn_o dist-stage2/build/CmmUtils.dyn_o dist-stage2/build/CmmZipUtil.dyn_o dist-stage2/build/DFMonad.dyn_o dist-stage2/build/Dataflow.dyn_o dist-stage2/build/MkZipCfg.dyn_o dist-stage2/build/MkZipCfgCmm.dyn_o dist-stage2/build/OptimizationFuel.dyn_o dist-stage2/build/PprC.dyn_o dist-stage2/build/PprCmm.dyn_o dist-stage2/build/PprCmmZ.dyn_o dist-stage2/build/StackColor.dyn_o dist-stage2/build/StackPlacements.dyn_o dist-stage2/build/ZipCfg.dyn_o dist-stage2/build/ZipCfgCmmRep.dyn_o dist-stage2/build/ZipCfgExtras.dyn_o dist-stage2/build/ZipDataflow.dyn_o dist-stage2/build/Bitmap.dyn_o dist-stage2/build/CgBindery.dyn_o dist-stage2/build/CgCallConv.dyn_o dist-stage2/build/CgCase.dyn_o dist-stage2/build/CgClosure.dyn_o dist-stage2/build/CgCon.dyn_o dist-stage2/build/CgExpr.dyn_o dist-stage2/build/CgForeignCall.dyn_o dist-stage2/build/CgHeapery.dyn_o dist-stage2/build/CgHpc.dyn_o dist-stage2/build/CgInfoTbls.dyn_o dist-stage2/build/CgLetNoEscape.dyn_o dist-stage2/build/CgMonad.dyn_o dist-stage2/build/CgParallel.dyn_o dist-stage2/build/CgPrimOp.dyn_o dist-stage2/build/CgProf.dyn_o dist-stage2/build/CgStackery.dyn_o dist-stage2/build/CgTailCall.dyn_o dist-stage2/build/CgTicky.dyn_o dist-stage2/build/CgUtils.dyn_o dist-stage2/build/StgCmm.dyn_o dist-stage2/build/StgCmmBind.dyn_o dist-stage2/build/StgCmmClosure.dyn_o dist-stage2/build/StgCmmCon.dyn_o dist-stage2/build/StgCmmEnv.dyn_o dist-stage2/build/StgCmmExpr.dyn_o dist-stage2/build/StgCmmForeign.dyn_o dist-stage2/build/StgCmmGran.dyn_o dist-stage2/build/StgCmmHeap.dyn_o dist-stage2/build/StgCmmHpc.dyn_o dist-stage2/build/StgCmmLayout.dyn_o dist-stage2/build/StgCmmMonad.dyn_o dist-stage2/build/StgCmmPrim.dyn_o dist-stage2/build/StgCmmProf.dyn_o dist-stage2/build/StgCmmTicky.dyn_o dist-stage2/build/StgCmmUtils.dyn_o dist-stage2/build/ClosureInfo.dyn_o dist-stage2/build/CodeGen.dyn_o dist-stage2/build/SMRep.dyn_o dist-stage2/build/CoreArity.dyn_o dist-stage2/build/CoreFVs.dyn_o dist-stage2/build/CoreLint.dyn_o dist-stage2/build/CorePrep.dyn_o dist-stage2/build/CoreSubst.dyn_o dist-stage2/build/CoreSyn.dyn_o dist-stage2/build/CoreTidy.dyn_o dist-stage2/build/CoreUnfold.dyn_o dist-stage2/build/CoreUtils.dyn_o dist-stage2/build/ExternalCore.dyn_o dist-stage2/build/MkCore.dyn_o dist-stage2/build/MkExternalCore.dyn_o dist-stage2/build/PprCore.dyn_o dist-stage2/build/PprExternalCore.dyn_o dist-stage2/build/CprAnalyse.dyn_o dist-stage2/build/Check.dyn_o dist-stage2/build/Coverage.dyn_o dist-stage2/build/Desugar.dyn_o dist-stage2/build/DsArrows.dyn_o dist-stage2/build/DsBinds.dyn_o dist-stage2/build/DsCCall.dyn_o dist-stage2/build/DsExpr.dyn_o dist-stage2/build/DsForeign.dyn_o dist-stage2/build/DsGRHSs.dyn_o dist-stage2/build/DsListComp.dyn_o dist-stage2/build/DsMonad.dyn_o dist-stage2/build/DsUtils.dyn_o dist-stage2/build/Match.dyn_o dist-stage2/build/MatchCon.dyn_o dist-stage2/build/MatchLit.dyn_o dist-stage2/build/HsBinds.dyn_o dist-stage2/build/HsDecls.dyn_o dist-stage2/build/HsDoc.dyn_o dist-stage2/build/HsExpr.dyn_o dist-stage2/build/HsImpExp.dyn_o dist-stage2/build/HsLit.dyn_o dist-stage2/build/HsPat.dyn_o dist-stage2/build/HsSyn.dyn_o dist-stage2/build/HsTypes.dyn_o dist-stage2/build/HsUtils.dyn_o dist-stage2/build/BinIface.dyn_o dist-stage2/build/BuildTyCl.dyn_o dist-stage2/build/IfaceEnv.dyn_o dist-stage2/build/IfaceSyn.dyn_o dist-stage2/build/IfaceType.dyn_o dist-stage2/build/LoadIface.dyn_o dist-stage2/build/MkIface.dyn_o dist-stage2/build/TcIface.dyn_o dist-stage2/build/Annotations.dyn_o dist-stage2/build/BreakArray.dyn_o dist-stage2/build/CmdLineParser.dyn_o dist-stage2/build/CodeOutput.dyn_o dist-stage2/build/Config.dyn_o dist-stage2/build/Constants.dyn_o dist-stage2/build/DriverMkDepend.dyn_o dist-stage2/build/DriverPhases.dyn_o dist-stage2/build/DriverPipeline.dyn_o dist-stage2/build/DynFlags.dyn_o dist-stage2/build/ErrUtils.dyn_o dist-stage2/build/Finder.dyn_o dist-stage2/build/GHC.dyn_o dist-stage2/build/HeaderInfo.dyn_o dist-stage2/build/HscMain.dyn_o dist-stage2/build/HscStats.dyn_o dist-stage2/build/HscTypes.dyn_o dist-stage2/build/InteractiveEval.dyn_o dist-stage2/build/PackageConfig.dyn_o dist-stage2/build/Packages.dyn_o dist-stage2/build/ParsePkgConf.dyn_o dist-stage2/build/PprTyThing.dyn_o dist-stage2/build/StaticFlags.dyn_o dist-stage2/build/StaticFlagParser.dyn_o dist-stage2/build/SysTools.dyn_o dist-stage2/build/TidyPgm.dyn_o dist-stage2/build/Ctype.dyn_o dist-stage2/build/HaddockLex.dyn_o dist-stage2/build/HaddockParse.dyn_o dist-stage2/build/HaddockUtils.dyn_o dist-stage2/build/LexCore.dyn_o dist-stage2/build/Lexer.dyn_o dist-stage2/build/Parser.dyn_o dist-stage2/build/ParserCore.dyn_o dist-stage2/build/ParserCoreUtils.dyn_o dist-stage2/build/RdrHsSyn.dyn_o dist-stage2/build/ForeignCall.dyn_o dist-stage2/build/PrelInfo.dyn_o dist-stage2/build/PrelNames.dyn_o dist-stage2/build/PrelRules.dyn_o dist-stage2/build/PrimOp.dyn_o dist-stage2/build/TysPrim.dyn_o dist-stage2/build/TysWiredIn.dyn_o dist-stage2/build/CostCentre.dyn_o dist-stage2/build/SCCfinal.dyn_o dist-stage2/build/RnBinds.dyn_o dist-stage2/build/RnEnv.dyn_o dist-stage2/build/RnExpr.dyn_o dist-stage2/build/RnHsDoc.dyn_o dist-stage2/build/RnHsSyn.dyn_o dist-stage2/build/RnNames.dyn_o dist-stage2/build/RnPat.dyn_o dist-stage2/build/RnSource.dyn_o dist-stage2/build/RnTypes.dyn_o dist-stage2/build/CoreMonad.dyn_o dist-stage2/build/CSE.dyn_o dist-stage2/build/FloatIn.dyn_o dist-stage2/build/FloatOut.dyn_o dist-stage2/build/LiberateCase.dyn_o dist-stage2/build/OccurAnal.dyn_o dist-stage2/build/SAT.dyn_o dist-stage2/build/SetLevels.dyn_o dist-stage2/build/SimplCore.dyn_o dist-stage2/build/SimplEnv.dyn_o dist-stage2/build/SimplMonad.dyn_o dist-stage2/build/SimplUtils.dyn_o dist-stage2/build/Simplify.dyn_o dist-stage2/build/SRT.dyn_o dist-stage2/build/SimplStg.dyn_o dist-stage2/build/StgStats.dyn_o dist-stage2/build/Rules.dyn_o dist-stage2/build/SpecConstr.dyn_o dist-stage2/build/Specialise.dyn_o dist-stage2/build/CoreToStg.dyn_o dist-stage2/build/StgLint.dyn_o dist-stage2/build/StgSyn.dyn_o dist-stage2/build/DmdAnal.dyn_o dist-stage2/build/SaAbsInt.dyn_o dist-stage2/build/SaLib.dyn_o dist-stage2/build/StrictAnal.dyn_o dist-stage2/build/WorkWrap.dyn_o dist-stage2/build/WwLib.dyn_o dist-stage2/build/FamInst.dyn_o dist-stage2/build/Inst.dyn_o dist-stage2/build/TcAnnotations.dyn_o dist-stage2/build/TcArrows.dyn_o dist-stage2/build/TcBinds.dyn_o dist-stage2/build/TcClassDcl.dyn_o dist-stage2/build/TcDefaults.dyn_o dist-stage2/build/TcDeriv.dyn_o dist-stage2/build/TcEnv.dyn_o dist-stage2/build/TcExpr.dyn_o dist-stage2/build/TcForeign.dyn_o dist-stage2/build/TcGenDeriv.dyn_o dist-stage2/build/TcHsSyn.dyn_o dist-stage2/build/TcHsType.dyn_o dist-stage2/build/TcInstDcls.dyn_o dist-stage2/build/TcMType.dyn_o dist-stage2/build/TcMatches.dyn_o dist-stage2/build/TcPat.dyn_o dist-stage2/build/TcRnDriver.dyn_o dist-stage2/build/TcRnMonad.dyn_o dist-stage2/build/TcRnTypes.dyn_o dist-stage2/build/TcRules.dyn_o dist-stage2/build/TcSimplify.dyn_o dist-stage2/build/TcTyClsDecls.dyn_o dist-stage2/build/TcTyDecls.dyn_o dist-stage2/build/TcTyFuns.dyn_o dist-stage2/build/TcType.dyn_o dist-stage2/build/TcUnify.dyn_o dist-stage2/build/Class.dyn_o dist-stage2/build/Coercion.dyn_o dist-stage2/build/FamInstEnv.dyn_o dist-stage2/build/FunDeps.dyn_o dist-stage2/build/Generics.dyn_o dist-stage2/build/InstEnv.dyn_o dist-stage2/build/TyCon.dyn_o dist-stage2/build/Type.dyn_o dist-stage2/build/TypeRep.dyn_o dist-stage2/build/Unify.dyn_o dist-stage2/build/Bag.dyn_o dist-stage2/build/Binary.dyn_o dist-stage2/build/BufWrite.dyn_o dist-stage2/build/Digraph.dyn_o dist-stage2/build/Encoding.dyn_o dist-stage2/build/FastBool.dyn_o dist-stage2/build/FastFunctions.dyn_o dist-stage2/build/FastMutInt.dyn_o dist-stage2/build/FastString.dyn_o dist-stage2/build/FastTypes.dyn_o dist-stage2/build/Fingerprint.dyn_o dist-stage2/build/FiniteMap.dyn_o dist-stage2/build/GraphBase.dyn_o dist-stage2/build/GraphColor.dyn_o dist-stage2/build/GraphOps.dyn_o dist-stage2/build/GraphPpr.dyn_o dist-stage2/build/IOEnv.dyn_o dist-stage2/build/Interval.dyn_o dist-stage2/build/LazyUniqFM.dyn_o dist-stage2/build/ListSetOps.dyn_o dist-stage2/build/Maybes.dyn_o dist-stage2/build/MonadUtils.dyn_o dist-stage2/build/OrdList.dyn_o dist-stage2/build/Outputable.dyn_o dist-stage2/build/Panic.dyn_o dist-stage2/build/Pretty.dyn_o dist-stage2/build/Serialized.dyn_o dist-stage2/build/State.dyn_o dist-stage2/build/StringBuffer.dyn_o dist-stage2/build/UniqFM.dyn_o dist-stage2/build/UniqSet.dyn_o dist-stage2/build/Util.dyn_o dist-stage2/build/VectBuiltIn.dyn_o dist-stage2/build/VectCore.dyn_o dist-stage2/build/VectMonad.dyn_o dist-stage2/build/VectType.dyn_o dist-stage2/build/VectUtils.dyn_o dist-stage2/build/Vectorise.dyn_o `find dist-stage2/build -name "*_stub.dyn_o" -print` -package-name ghc-6.11.20090305 -package Cabal-1.7.0 -package array-0.2.0.1 -package base-4.0.0.0 -package bytestring-0.9.1.4 -package containers-0.2.0.1 -package directory-1.0.0.2 -package editline-0.2.1.0 -package filepath-1.1.0.1 -package haskell98-1.0.1.0 -package hpc-0.5.0.2 -package old-time-1.0.0.1 -package process-1.0.1.1 -package template-haskell-2.3.0.0 -package unix-2.3.1.0
2== Finished recursively making `all' for ways: dyn ...
3make[3]: Leaving directory `/home/petersen/ghc/devel/ghc-6.11.20090305/compiler'
4/home/petersen/ghc/devel/ghc-6.11.20090305/libraries/cabal-bin /usr/bin/ghc /home/petersen/ghc/devel/ghc-6.11.20090305/libraries/bootstrapping.conf 1.7.0 register  --distpref dist-stage2 --inplace
5Registering ghc-6.11.20090305...
6Reading package info from "dist-stage2/inplace-pkg-config" ... done.
7Writing new package config file... done.
8make -C ../ghc stage=2
9make[3]: Entering directory `/home/petersen/ghc/devel/ghc-6.11.20090305/ghc'
10/home/petersen/ghc/devel/ghc-6.11.20090305/libraries/cabal-bin /usr/bin/ghc /home/petersen/ghc/devel/ghc-6.11.20090305/libraries/bootstrapping.conf 1.7.0 configure --distpref dist-stage2         \
11                           --prefix=/NONEXISTENT --bindir=/NONEXISTENT --libdir=/NONEXISTENT --libexecdir=/NONEXISTENT --datadir=/NONEXISTENT --docdir=/NONEXISTENT --haddockdir=/NONEXISTENT --htmldir=/NONEXISTENT \
12                           --flags=ghci --ghc-option=-threaded --ghc-option=-dynamic --with-compiler=/home/petersen/ghc/devel/ghc-6.11.20090305/ghc/stage1-inplace/ghc --with-hc-pkg=/home/petersen/ghc/devel/ghc-6.11.20090305/utils/ghc-pkg/install-inplace/bin/ghc-pkg    --ghc-option=-O2      \
13                           --libsubdir='$pkgid' --with-gcc=gcc --with-ld=/usr/bin/ld  --with-happy="/usr/bin/happy"    --configure-option='--prefix=/usr'  --configure-option='--exec-prefix=/usr'  --configure-option='--bindir=/usr/bin'  --configure-option='--sbindir=/usr/sbin'  --configure-option='--sysconfdir=/etc'  --configure-option='--datadir=/usr/share'  --configure-option='--includedir=/usr/include'  --configure-option='--libdir=/usr/lib'  --configure-option='--libexecdir=/usr/libexec'  --configure-option='--localstatedir=/var'  --configure-option='--sharedstatedir=/var/lib'  --configure-option='--mandir=/usr/share/man'  --configure-option='--enable-shared' --configure-option=--with-cc="gcc" --with-hsc2hs=/home/petersen/ghc/devel/ghc-6.11.20090305/utils/hsc2hs/install-inplace/bin/hsc2hs       \
14                           --libsubdir=.                   \
15                           --datadir='$libdir'            \
16                           --datasubdir=.
17Configuring ghc-bin-6.11.20090305...
18Warning: 'data-dir: ..' is a relative path outside of the source tree. This
19will not work when generating a tarball with 'sdist'.
20/home/petersen/ghc/devel/ghc-6.11.20090305/libraries/cabal-bin /usr/bin/ghc /home/petersen/ghc/devel/ghc-6.11.20090305/libraries/bootstrapping.conf 1.7.0 build     --distpref dist-stage2 --ghc-option=-H32m --ghc-option=-O  --ghc-option=-H32m  --ghc-option=-O
21Preprocessing executables for ghc-bin-6.11.20090305...
22Building ghc-bin-6.11.20090305...
23[1 of 1] Compiling Main             ( Main.hs, dist-stage2/build/ghc/ghc-tmp/Main.o )
24Linking dist-stage2/build/ghc/ghc ...
25/usr/bin/ld: cannot find -lHSrts_thr-ghc6.11.20090305
26collect2: ld returned 1 exit status
27make[3]: *** [build.stage.2] Error 1
28make[3]: Leaving directory `/home/petersen/ghc/devel/ghc-6.11.20090305/ghc'
29make[2]: *** [build.stage.2] Error 2
30make[2]: Leaving directory `/home/petersen/ghc/devel/ghc-6.11.20090305/compiler'
31make[1]: *** [stage2] Error 2
32make[1]: Leaving directory `/home/petersen/ghc/devel/ghc-6.11.20090305'
33make: *** [bootstrap2] Error 2